null
SMILES: Fc1cc(OC(F)(F)F)ccc1COC(=O)N1CC2(C1)CCN(CC2)C(=O)C1CCc2[nH]nnc2C1
InChI Key:
Activity Spreadsheet -- Enzyme Inhibition Constant Data from BindingDB
Found 2 hits for monomerid = 258579
Trg + Lig
Ki
nM
ΔG°
kcal/mole
IC50
nM
Kd
nM
EC50/IC50
nM
koff
s-1
kon
M-1s-1
pHTemp
°C
Ataxin-2
(Homo sapiens (Human))
BDBM258579
(US10633384, Example 12.41 | US9493486, 12.41)
Show SMILES Fc1cc(OC(F)(F)F)ccc1COC(=O)N1CC2(C1)CCN(CC2)C(=O)C1CCc2[nH]nnc2C1
US Patent
n/an/a 2n/an/an/an/an/an/a
Hoffmann-La Roche Inc.
US Patent
Assay Description
ATX inhibition was measured by a fluorescence quenching assay using a specifically labeled substrate analogue (MR121 substrate). To obtain this MR121...
US Patent US10633384 (2020)
BindingDB Entry DOI: 10.7270/Q2K077BX
Ectonucleotide pyrophosphatase/phosphodiesterase family member 2
(Homo sapiens (Human))
BDBM258579
(US10633384, Example 12.41 | US9493486, 12.41)
Show SMILES Fc1cc(OC(F)(F)F)ccc1COC(=O)N1CC2(C1)CCN(CC2)C(=O)C1CCc2[nH]nnc2C1
US Patent
n/an/a 2n/an/an/an/a8.030
Hoffmann-La Roches Inc.
US Patent
Assay Description
ATX inhibition was measured by a fluorescence quenching assay using a specifically labeled substrate analogue (MR121 substrate). To obtain this MR121...
US Patent US9493486 (2016)
BindingDB Entry DOI: 10.7270/Q2VT1R1K