null
SMILES: CS(=O)(=O)c1cc(COC(=O)N2CCC3(CN(C3)S(=O)(=O)c3ccc4[nH]c(=O)oc4c3)CC2)cc(c1)C(F)(F)F
InChI Key: InChIKey=SAUMRYSIRCXBFC-UHFFFAOYSA-N
Activity Spreadsheet -- Enzyme Inhibition Constant Data from BindingDB
Found 2 hits for monomerid = 258583
Trg + Lig
Ki
nM
ΔG°
kcal/mole
IC50
nM
Kd
nM
EC50/IC50
nM
koff
s-1
kon
M-1s-1
pHTemp
°C
Ataxin-2
(Homo sapiens (Human))
BDBM258583
(US10633384, Example 12.45 | US9493486, 12.45)
Show SMILES CS(=O)(=O)c1cc(COC(=O)N2CCC3(CN(C3)S(=O)(=O)c3ccc4[nH]c(=O)oc4c3)CC2)cc(c1)C(F)(F)F
Show InChI InChI=1S/C24H24F3N3O8S2/c1-39(33,34)18-9-15(8-16(10-18)24(25,26)27)12-37-22(32)29-6-4-23(5-7-29)13-30(14-23)40(35,36)17-2-3-19-20(11-17)38-21(31)28-19/h2-3,8-11H,4-7,12-14H2,1H3,(H,28,31)
US Patent
n/an/a 39n/an/an/an/an/an/a
Hoffmann-La Roche Inc.
US Patent
Assay Description
ATX inhibition was measured by a fluorescence quenching assay using a specifically labeled substrate analogue (MR121 substrate). To obtain this MR121...
US Patent US10633384 (2020)
BindingDB Entry DOI: 10.7270/Q2K077BX
Ectonucleotide pyrophosphatase/phosphodiesterase family member 2
(Homo sapiens (Human))
BDBM258583
(US10633384, Example 12.45 | US9493486, 12.45)
Show SMILES CS(=O)(=O)c1cc(COC(=O)N2CCC3(CN(C3)S(=O)(=O)c3ccc4[nH]c(=O)oc4c3)CC2)cc(c1)C(F)(F)F
Show InChI InChI=1S/C24H24F3N3O8S2/c1-39(33,34)18-9-15(8-16(10-18)24(25,26)27)12-37-22(32)29-6-4-23(5-7-29)13-30(14-23)40(35,36)17-2-3-19-20(11-17)38-21(31)28-19/h2-3,8-11H,4-7,12-14H2,1H3,(H,28,31)
US Patent
n/an/a 39n/an/an/an/a8.030
Hoffmann-La Roches Inc.
US Patent
Assay Description
ATX inhibition was measured by a fluorescence quenching assay using a specifically labeled substrate analogue (MR121 substrate). To obtain this MR121...
US Patent US9493486 (2016)
BindingDB Entry DOI: 10.7270/Q2VT1R1K