BDBM258769 US9499482, 169
SMILES: CCc1cc(ccc1OCCN1CC(C)(O)C1)N1CC=C(Oc2ccc(cc2)C2CC2)C1=O
InChI Key: InChIKey=CXGQBRPNVNQJAE-UHFFFAOYSA-N
Data: 1 KI
Activity Spreadsheet -- Enzyme Inhibition Constant Data from BindingDB
Found 1 hit for monomerid = 258769
Trg + Lig
Ki
nM
ΔG°
kcal/mole
IC50
nM
Kd
nM
EC50/IC50
nM
koff
s-1
kon
M-1s-1
pHTemp
°C
Melanin-concentrating hormone receptor 1 (MCHR1)(E4Q)(A5T)
(Homo sapiens (Human))
BDBM258769
(US9499482, 169)
Show SMILES CCc1cc(ccc1OCCN1CC(C)(O)C1)N1CC=C(Oc2ccc(cc2)C2CC2)C1=O |t:21|
Show InChI InChI=1S/C27H32N2O4/c1-3-19-16-22(8-11-24(19)32-15-14-28-17-27(2,31)18-28)29-13-12-25(26(29)30)33-23-9-6-21(7-10-23)20-4-5-20/h6-12,16,20,31H,3-5,13-15,17-18H2,1-2H3
US Patent
0.5n/an/an/an/an/an/a7.4n/a
Bristol-Myers Squibb Company
US Patent
Assay Description
An in vitro binding assay was used to determine the compound Ki value or ability to antagonize binding of a peptide agonist to the human melanin conc...
US Patent US9499482 (2016)
BindingDB Entry DOI: 10.7270/Q2M907KT