BDBM258891 US9499502, 1
SMILES: C[C@]1(CS(=O)(=O)C(C)(C)C(=N)N1)c1cc(NC(=O)c2ccc(F)cn2)ccc1F
InChI Key: InChIKey=IXNHXYGWJABLFS-IBGZPJMESA-N
Data: 2 KI
Activity Spreadsheet -- Enzyme Inhibition Constant Data from BindingDB
Found 2 hits for monomerid = 258891
Trg + Lig
Ki
nM
ΔG°
kcal/mole
IC50
nM
Kd
nM
EC50/IC50
nM
koff
s-1
kon
M-1s-1
pHTemp
°C
Beta-secretase 1
(Homo sapiens (Human))
BDBM258891
(US9499502, 1)
Show SMILES C[C@]1(CS(=O)(=O)C(C)(C)C(=N)N1)c1cc(NC(=O)c2ccc(F)cn2)ccc1F |r|
Show InChI InChI=1S/C19H20F2N4O3S/c1-18(2)17(22)25-19(3,10-29(18,27)28)13-8-12(5-6-14(13)21)24-16(26)15-7-4-11(20)9-23-15/h4-9H,10H2,1-3H3,(H2,22,25)(H,24,26)/t19-/m0/s1
US Patent
1.20 -12.4n/an/an/an/an/a5.030
Merck Sharp & Dohme Corp.
US Patent
Assay Description
A homogeneous time-resolved FRET assay can be used to determine IC50 values for inhibitors of the soluble human BACE1 catalytic domain. This assay mo...
US Patent US9499502 (2016)
BindingDB Entry DOI: 10.7270/Q2BV7FJJ
Beta-secretase 2
(Homo sapiens (Human))
BDBM258891
(US9499502, 1)
Show SMILES C[C@]1(CS(=O)(=O)C(C)(C)C(=N)N1)c1cc(NC(=O)c2ccc(F)cn2)ccc1F |r|
Show InChI InChI=1S/C19H20F2N4O3S/c1-18(2)17(22)25-19(3,10-29(18,27)28)13-8-12(5-6-14(13)21)24-16(26)15-7-4-11(20)9-23-15/h4-9H,10H2,1-3H3,(H2,22,25)(H,24,26)/t19-/m0/s1
US Patent
<10<-11.1n/an/an/an/an/a5.030
Merck Sharp & Dohme Corp.
US Patent
Assay Description
Inhibitor IC50s at purified human autoBACE-2 are determined in a time-resolved endpoint proteolysis assay that measures hydrolysis of the QSY7-EISEVN...
US Patent US9499502 (2016)
BindingDB Entry DOI: 10.7270/Q2BV7FJJ