BDBM2589 1-Hydroxy-3,4-bis(3-indolyl)-2,5-pyrroledione::1-hydroxy-3,4-bis(1H-indol-3-yl)-2,5-dihydro-1H-pyrrole-2,5-dione::Bisindolylmaleimide deriv. 11
SMILES: ON1C(=O)C(=C(C1=O)c1c[nH]c2ccccc12)c1c[nH]c2ccccc12
InChI Key: InChIKey=STOYHVQKKWVYFE-UHFFFAOYSA-N
Data: 1 IC50
Activity Spreadsheet -- Enzyme Inhibition Constant Data from BindingDB
Found 1 hit for monomerid = 2589
Trg + Lig
Ki
nM
ΔG°
kcal/mole
IC50
nM
Kd
nM
EC50/IC50
nM
koff
s-1
kon
M-1s-1
pHTemp
°C
Protein Kinase C
(Rattus norvegicus (rat))
BDBM2589
(1-Hydroxy-3,4-bis(3-indolyl)-2,5-pyrroledione | 1-...)
Show SMILES ON1C(=O)C(=C(C1=O)c1c[nH]c2ccccc12)c1c[nH]c2ccccc12 |c:4|
Show InChI InChI=1S/C20H13N3O3/c24-19-17(13-9-21-15-7-3-1-5-11(13)15)18(20(25)23(19)26)14-10-22-16-8-4-2-6-12(14)16/h1-10,21-22,26H
n/an/a 2.89E+4n/an/an/an/a7.530
Roche Products Limited
Assay Description
The activity of PKC, activated by phosphatidylerine and Ca2+, is measured by its ability to transfer phosphate from [gamma-32P]ATP to lysine-rich his...
J Med Chem 35: 177-84 (1992)
Article DOI: 10.1021/jm00079a024
BindingDB Entry DOI: 10.7270/Q2K64G8V