BDBM258951 US9499502, 9ba
SMILES: C[C@]1(CS(=O)(=O)C(C)(C)C(=N)N1)c1cc(NC(=O)c2ncc(F)cc2F)cc(F)c1F
InChI Key: InChIKey=TYKNJIJSJJKNDB-IBGZPJMESA-N
Data: 2 KI
Activity Spreadsheet -- Enzyme Inhibition Constant Data from BindingDB
Found 2 hits for monomerid = 258951
Trg + Lig
Ki
nM
ΔG°
kcal/mole
IC50
nM
Kd
nM
EC50/IC50
nM
koff
s-1
kon
M-1s-1
pHTemp
°C
Beta-secretase 2
(Homo sapiens (Human))
BDBM258951
(US9499502, 9ba)
Show SMILES C[C@]1(CS(=O)(=O)C(C)(C)C(=N)N1)c1cc(NC(=O)c2ncc(F)cc2F)cc(F)c1F |r|
Show InChI InChI=1S/C19H18F4N4O3S/c1-18(2)17(24)27-19(3,8-31(18,29)30)11-5-10(6-12(21)14(11)23)26-16(28)15-13(22)4-9(20)7-25-15/h4-7H,8H2,1-3H3,(H2,24,27)(H,26,28)/t19-/m0/s1
US Patent
1 -12.5n/an/an/an/an/a5.030
Merck Sharp & Dohme Corp.
US Patent
Assay Description
Inhibitor IC50s at purified human autoBACE-2 are determined in a time-resolved endpoint proteolysis assay that measures hydrolysis of the QSY7-EISEVN...
US Patent US9499502 (2016)
BindingDB Entry DOI: 10.7270/Q2BV7FJJ
Beta-secretase 1
(Homo sapiens (Human))
BDBM258951
(US9499502, 9ba)
Show SMILES C[C@]1(CS(=O)(=O)C(C)(C)C(=N)N1)c1cc(NC(=O)c2ncc(F)cc2F)cc(F)c1F |r|
Show InChI InChI=1S/C19H18F4N4O3S/c1-18(2)17(24)27-19(3,8-31(18,29)30)11-5-10(6-12(21)14(11)23)26-16(28)15-13(22)4-9(20)7-25-15/h4-7H,8H2,1-3H3,(H2,24,27)(H,26,28)/t19-/m0/s1
US Patent
21 -10.6n/an/an/an/an/a5.030
Merck Sharp & Dohme Corp.
US Patent
Assay Description
A homogeneous time-resolved FRET assay can be used to determine IC50 values for inhibitors of the soluble human BACE1 catalytic domain. This assay mo...
US Patent US9499502 (2016)
BindingDB Entry DOI: 10.7270/Q2BV7FJJ