BDBM259032 US9499502, 9dl-a
SMILES: C[C@]1(CS(=O)(=O)[C@@](C)(CC2CC2)C(=N)N1)c1cc(NC(=O)c2ccc(cn2)C(F)(F)F)ccc1F
InChI Key: InChIKey=YOULZVFEEDUUAK-VXKWHMMOSA-N
Data: 2 KI
Activity Spreadsheet -- Enzyme Inhibition Constant Data from BindingDB
Found 2 hits for monomerid = 259032
Trg + Lig
Ki
nM
ΔG°
kcal/mole
IC50
nM
Kd
nM
EC50/IC50
nM
koff
s-1
kon
M-1s-1
pHTemp
°C
Beta-secretase 1
(Homo sapiens (Human))
BDBM259032
(US9499502, 9dl-a)
Show SMILES C[C@]1(CS(=O)(=O)[C@@](C)(CC2CC2)C(=N)N1)c1cc(NC(=O)c2ccc(cn2)C(F)(F)F)ccc1F |r|
Show InChI InChI=1S/C23H24F4N4O3S/c1-21(12-35(33,34)22(2,20(28)31-21)10-13-3-4-13)16-9-15(6-7-17(16)24)30-19(32)18-8-5-14(11-29-18)23(25,26)27/h5-9,11,13H,3-4,10,12H2,1-2H3,(H2,28,31)(H,30,32)/t21-,22-/m0/s1
US Patent
4.40 -11.6n/an/an/an/an/a5.030
Merck Sharp & Dohme Corp.
US Patent
Assay Description
A homogeneous time-resolved FRET assay can be used to determine IC50 values for inhibitors of the soluble human BACE1 catalytic domain. This assay mo...
US Patent US9499502 (2016)
BindingDB Entry DOI: 10.7270/Q2BV7FJJ
Beta-secretase 2
(Homo sapiens (Human))
BDBM259032
(US9499502, 9dl-a)
Show SMILES C[C@]1(CS(=O)(=O)[C@@](C)(CC2CC2)C(=N)N1)c1cc(NC(=O)c2ccc(cn2)C(F)(F)F)ccc1F |r|
Show InChI InChI=1S/C23H24F4N4O3S/c1-21(12-35(33,34)22(2,20(28)31-21)10-13-3-4-13)16-9-15(6-7-17(16)24)30-19(32)18-8-5-14(11-29-18)23(25,26)27/h5-9,11,13H,3-4,10,12H2,1-2H3,(H2,28,31)(H,30,32)/t21-,22-/m0/s1
US Patent
<10<-11.1n/an/an/an/an/a5.030
Merck Sharp & Dohme Corp.
US Patent
Assay Description
Inhibitor IC50s at purified human autoBACE-2 are determined in a time-resolved endpoint proteolysis assay that measures hydrolysis of the QSY7-EISEVN...
US Patent US9499502 (2016)
BindingDB Entry DOI: 10.7270/Q2BV7FJJ