BDBM259034 US9499502, 9dm-a
SMILES: COc1cnc(cn1)C(=O)Nc1ccc(F)c(c1)[C@]1(C)CS(=O)(=O)[C@@](C)(CC=C)C(=N)N1
InChI Key: InChIKey=ZUJKHLJVNCJGJC-SFTDATJTSA-N
Data: 2 KI
Activity Spreadsheet -- Enzyme Inhibition Constant Data from BindingDB
Found 2 hits for monomerid = 259034
Trg + Lig
Ki
nM
ΔG°
kcal/mole
IC50
nM
Kd
nM
EC50/IC50
nM
koff
s-1
kon
M-1s-1
pHTemp
°C
Beta-secretase 1
(Homo sapiens (Human))
BDBM259034
(US9499502, 9dm-a)
Show SMILES COc1cnc(cn1)C(=O)Nc1ccc(F)c(c1)[C@]1(C)CS(=O)(=O)[C@@](C)(CC=C)C(=N)N1 |r|
Show InChI InChI=1S/C21H24FN5O4S/c1-5-8-21(3)19(23)27-20(2,12-32(21,29)30)14-9-13(6-7-15(14)22)26-18(28)16-10-25-17(31-4)11-24-16/h5-7,9-11H,1,8,12H2,2-4H3,(H2,23,27)(H,26,28)/t20-,21-/m0/s1
US Patent
4 -11.6n/an/an/an/an/a5.030
Merck Sharp & Dohme Corp.
US Patent
Assay Description
A homogeneous time-resolved FRET assay can be used to determine IC50 values for inhibitors of the soluble human BACE1 catalytic domain. This assay mo...
US Patent US9499502 (2016)
BindingDB Entry DOI: 10.7270/Q2BV7FJJ
Beta-secretase 2
(Homo sapiens (Human))
BDBM259034
(US9499502, 9dm-a)
Show SMILES COc1cnc(cn1)C(=O)Nc1ccc(F)c(c1)[C@]1(C)CS(=O)(=O)[C@@](C)(CC=C)C(=N)N1 |r|
Show InChI InChI=1S/C21H24FN5O4S/c1-5-8-21(3)19(23)27-20(2,12-32(21,29)30)14-9-13(6-7-15(14)22)26-18(28)16-10-25-17(31-4)11-24-16/h5-7,9-11H,1,8,12H2,2-4H3,(H2,23,27)(H,26,28)/t20-,21-/m0/s1
US Patent
<10<-11.1n/an/an/an/an/a5.030
Merck Sharp & Dohme Corp.
US Patent
Assay Description
Inhibitor IC50s at purified human autoBACE-2 are determined in a time-resolved endpoint proteolysis assay that measures hydrolysis of the QSY7-EISEVN...
US Patent US9499502 (2016)
BindingDB Entry DOI: 10.7270/Q2BV7FJJ