null
SMILES: C[C@@H](N)COc1ccc2ncc(-c3cc4ccccc4o3)n2n1
InChI Key: InChIKey=PHYSAVSMINAZFZ-LLVKDONJSA-N
Activity Spreadsheet -- Enzyme Inhibition Constant Data from BindingDB
Found 2 hits for monomerid = 259301
Trg + Lig
Ki
nM
ΔG°
kcal/mole
IC50
nM
Kd
nM
EC50/IC50
nM
koff
s-1
kon
M-1s-1
pHTemp
°C
Glutathione S-transferase P/Isoform 2 of MAP kinase-interacting serine/threonine-protein kinase 1 (MNK1a) [T344D]
(Homo sapiens (Human))
BDBM259301
(US9499547, 42)
Show SMILES C[C@@H](N)COc1ccc2ncc(-c3cc4ccccc4o3)n2n1 |r|
Show InChI InChI=1S/C17H16N4O2/c1-11(18)10-22-17-7-6-16-19-9-13(21(16)20-17)15-8-12-4-2-3-5-14(12)23-15/h2-9,11H,10,18H2,1H3/t11-/m1/s1
Reactome pathway
US Patent
n/an/a 43n/an/an/an/a7.522
BAYER INTELLECTUAL PROPERTY GMBH
US Patent
Assay Description
MKNK1-inhibitory activity at high ATP of compounds of the present invention after their preincubation with MKNK1 was quantified employing the TR-FRET...
US Patent US9499547 (2016)
BindingDB Entry DOI: 10.7270/Q2736PVK
Glutathione S-transferase P/Isoform 2 of MAP kinase-interacting serine/threonine-protein kinase 1 (MNK1a) [T344D]
(Homo sapiens (Human))
BDBM259301
(US9499547, 42)
Show SMILES C[C@@H](N)COc1ccc2ncc(-c3cc4ccccc4o3)n2n1 |r|
Show InChI InChI=1S/C17H16N4O2/c1-11(18)10-22-17-7-6-16-19-9-13(21(16)20-17)15-8-12-4-2-3-5-14(12)23-15/h2-9,11H,10,18H2,1H3/t11-/m1/s1
Reactome pathway
US Patent
n/an/a 15n/an/an/an/a7.522
BAYER INTELLECTUAL PROPERTY GMBH
US Patent
Assay Description
A recombinant fusion protein of Glutathione-S-Transferase (GST, N-terminally) and human full-length MKNK1 (amino acids 1-424 and T344D of accession n...
US Patent US9499547 (2016)
BindingDB Entry DOI: 10.7270/Q2736PVK