BDBM259414 US10457647, Example 13::US9512084, 13
SMILES: Cc1c(NC(=O)c2ccc(cc2F)C2CC2)cc(F)cc1-c1ncnc(N)c1OCCNC(=O)C=C
InChI Key: InChIKey=QYSHAEHPLLSZKX-UHFFFAOYSA-N
Data: 5 IC50
Activity Spreadsheet -- Enzyme Inhibition Constant Data from BindingDB
Found 6 hits for monomerid = 259414
Trg + Lig
Ki
nM
ΔG°
kcal/mole
IC50
nM
Kd
nM
EC50/IC50
nM
koff
s-1
kon
M-1s-1
pHTemp
°C
Tyrosine-protein kinase BTK
(Homo sapiens (Human))
BDBM259414
(US10457647, Example 13 | US11180460, Example 13 | ...)
Show SMILES Cc1c(NC(=O)c2ccc(cc2F)C2CC2)cc(F)cc1-c1ncnc(N)c1OCCNC(=O)C=C
Show InChI InChI=1S/C26H25F2N5O3/c1-3-22(34)30-8-9-36-24-23(31-13-32-25(24)29)19-11-17(27)12-21(14(19)2)33-26(35)18-7-6-16(10-20(18)28)15-4-5-15/h3,6-7,10-13,15H,1,4-5,8-9H2,2H3,(H,30,34)(H,33,35)(H2,29,31,32)
NCI pathway
Reactome pathway
US Patent
n/an/a 7n/an/an/an/a7.530
Novartis AG
US Patent
Assay Description
The inhibitory activity of the present compounds against Btk was assessed in a biochemical enzyme assay. Assay plates in 384 well format were prepare...
US Patent US9512084 (2016)
BindingDB Entry DOI: 10.7270/Q2ZK5FMH
Tyrosine-protein kinase BTK
(Homo sapiens (Human))
BDBM259414
(US10457647, Example 13 | US11180460, Example 13 | ...)
Show SMILES Cc1c(NC(=O)c2ccc(cc2F)C2CC2)cc(F)cc1-c1ncnc(N)c1OCCNC(=O)C=C
Show InChI InChI=1S/C26H25F2N5O3/c1-3-22(34)30-8-9-36-24-23(31-13-32-25(24)29)19-11-17(27)12-21(14(19)2)33-26(35)18-7-6-16(10-20(18)28)15-4-5-15/h3,6-7,10-13,15H,1,4-5,8-9H2,2H3,(H,30,34)(H,33,35)(H2,29,31,32)
NCI pathway
Reactome pathway
US Patent
n/an/a 7n/an/an/an/an/an/a
Novartis AG
US Patent
Assay Description
The inhibitory activity of the present compounds against Btk was assessed in a biochemical enzyme assay. Assay plates in 384 well format were prepare...
US Patent US10457647 (2019)
BindingDB Entry DOI: 10.7270/Q2KH0QPQ
Tyrosine-protein kinase BTK
(Homo sapiens (Human))
BDBM259414
(US10457647, Example 13 | US11180460, Example 13 | ...)
Show SMILES Cc1c(NC(=O)c2ccc(cc2F)C2CC2)cc(F)cc1-c1ncnc(N)c1OCCNC(=O)C=C
Show InChI InChI=1S/C26H25F2N5O3/c1-3-22(34)30-8-9-36-24-23(31-13-32-25(24)29)19-11-17(27)12-21(14(19)2)33-26(35)18-7-6-16(10-20(18)28)15-4-5-15/h3,6-7,10-13,15H,1,4-5,8-9H2,2H3,(H,30,34)(H,33,35)(H2,29,31,32)
NCI pathway
Reactome pathway
n/an/a 7n/an/an/an/an/an/a
TBA
Citation and Details
Tyrosine-protein kinase BTK
(Homo sapiens (Human))
BDBM259414
(US10457647, Example 13 | US11180460, Example 13 | ...)
Show SMILES Cc1c(NC(=O)c2ccc(cc2F)C2CC2)cc(F)cc1-c1ncnc(N)c1OCCNC(=O)C=C
Show InChI InChI=1S/C26H25F2N5O3/c1-3-22(34)30-8-9-36-24-23(31-13-32-25(24)29)19-11-17(27)12-21(14(19)2)33-26(35)18-7-6-16(10-20(18)28)15-4-5-15/h3,6-7,10-13,15H,1,4-5,8-9H2,2H3,(H,30,34)(H,33,35)(H2,29,31,32)
NCI pathway
Reactome pathway
n/an/a 18n/an/an/an/an/an/a
TBA
Curated by ChEMBL
Assay Description
Inhibition of BTK in vitamin D3 differentiated human THP1 cells assessed as inhibition of FCgammaR-induced IL8 production measured after 24 hrs by HT...
J Med Chem 63: 5102-5118 (2020)
Article DOI: 10.1021/acs.jmedchem.9b01916
Tyrosine-protein kinase BTK
(Homo sapiens (Human))
BDBM259414
(US10457647, Example 13 | US11180460, Example 13 | ...)
Show SMILES Cc1c(NC(=O)c2ccc(cc2F)C2CC2)cc(F)cc1-c1ncnc(N)c1OCCNC(=O)C=C
Show InChI InChI=1S/C26H25F2N5O3/c1-3-22(34)30-8-9-36-24-23(31-13-32-25(24)29)19-11-17(27)12-21(14(19)2)33-26(35)18-7-6-16(10-20(18)28)15-4-5-15/h3,6-7,10-13,15H,1,4-5,8-9H2,2H3,(H,30,34)(H,33,35)(H2,29,31,32)
NCI pathway
Reactome pathway
n/an/a 105n/an/an/an/an/an/a
TBA
Curated by ChEMBL
Assay Description
Inhibition of BTK in human B cells assessed as reduction in anti-IgM/IL4-stimulated CD69 expression on B cells preincubated for 60 mins followed by a...
J Med Chem 63: 5102-5118 (2020)
Article DOI: 10.1021/acs.jmedchem.9b01916
Tyrosine-protein kinase BTK
(Homo sapiens (Human))
BDBM259414
(US10457647, Example 13 | US11180460, Example 13 | ...)
Show SMILES Cc1c(NC(=O)c2ccc(cc2F)C2CC2)cc(F)cc1-c1ncnc(N)c1OCCNC(=O)C=C
Show InChI InChI=1S/C26H25F2N5O3/c1-3-22(34)30-8-9-36-24-23(31-13-32-25(24)29)19-11-17(27)12-21(14(19)2)33-26(35)18-7-6-16(10-20(18)28)15-4-5-15/h3,6-7,10-13,15H,1,4-5,8-9H2,2H3,(H,30,34)(H,33,35)(H2,29,31,32)
NCI pathway
Reactome pathway
n/an/a 8.70n/an/an/an/an/an/a
TBA
Curated by ChEMBL
Assay Description
Inhibition of full-length human recombinant BTK using FITC-Ahx-TSELKKVVALYDYMPMNAND-NH2 as substrate measured after 60 mins by caliper assay
J Med Chem 63: 5102-5118 (2020)
Article DOI: 10.1021/acs.jmedchem.9b01916