null
SMILES: C[C@H](Nc1ncnc(N)c1-c1nc(C)no1)c1cc2cccc(Cl)c2c(=O)n1-c1ccccc1
InChI Key: InChIKey=VOHXNNFKUJLLLQ-ZDUSSCGKSA-N
Activity Spreadsheet -- Enzyme Inhibition Constant Data from BindingDB
Found 8 hits for monomerid = 259449
Trg + Lig
Ki
nM
ΔG°
kcal/mole
IC50
nM
Kd
nM
EC50/IC50
nM
koff
s-1
kon
M-1s-1
pHTemp
°C
Phosphatidylinositol 3-kinase regulatory subunit alpha/4,5-bisphosphate 3-kinase catalytic subunit alpha isoform
(Homo sapiens (Human))
BDBM259449
(US9512114, 8 | US9657007, Example 8)
Show SMILES C[C@H](Nc1ncnc(N)c1-c1nc(C)no1)c1cc2cccc(Cl)c2c(=O)n1-c1ccccc1 |r|
Show InChI InChI=1S/C24H20ClN7O2/c1-13(29-22-20(21(26)27-12-28-22)23-30-14(2)31-34-23)18-11-15-7-6-10-17(25)19(15)24(33)32(18)16-8-4-3-5-9-16/h3-13H,1-2H3,(H3,26,27,28,29)/t13-/m0/s1
US Patent
n/an/a 276n/an/an/an/an/a25
CALITOR SCIENCES, LLC; SUNSHINE LAKE PHARMA CO., LTD.
US Patent
Assay Description
PI3K (p110α/p85α) (h) is incubated in assay buffer containing 10 μM phosphatidylinositol 4,5-bisphosphate and MgATP (concentration as ...
US Patent US9512114 (2016)
BindingDB Entry DOI: 10.7270/Q2TT4PWS
Phosphatidylinositol 3-kinase regulatory subunit alpha/4,5-bisphosphate 3-kinase catalytic subunit beta isoform
(Homo sapiens (Human))
BDBM259449
(US9512114, 8 | US9657007, Example 8)
Show SMILES C[C@H](Nc1ncnc(N)c1-c1nc(C)no1)c1cc2cccc(Cl)c2c(=O)n1-c1ccccc1 |r|
Show InChI InChI=1S/C24H20ClN7O2/c1-13(29-22-20(21(26)27-12-28-22)23-30-14(2)31-34-23)18-11-15-7-6-10-17(25)19(15)24(33)32(18)16-8-4-3-5-9-16/h3-13H,1-2H3,(H3,26,27,28,29)/t13-/m0/s1
US Patent
n/an/a 33n/an/an/an/an/a25
CALITOR SCIENCES, LLC; SUNSHINE LAKE PHARMA CO., LTD.
US Patent
Assay Description
PI3K (p1103/p85α) (h) is incubated in assay buffer containing 10 μM phosphatidylinositol-4, 5-bisphosphate and MgATP (concentration as requ...
US Patent US9512114 (2016)
BindingDB Entry DOI: 10.7270/Q2TT4PWS
Phosphatidylinositol 3-kinase regulatory subunit alpha/4,5-bisphosphate 3-kinase catalytic subunit delta isoform
(Homo sapiens (Human))
BDBM259449
(US9512114, 8 | US9657007, Example 8)
Show SMILES C[C@H](Nc1ncnc(N)c1-c1nc(C)no1)c1cc2cccc(Cl)c2c(=O)n1-c1ccccc1 |r|
Show InChI InChI=1S/C24H20ClN7O2/c1-13(29-22-20(21(26)27-12-28-22)23-30-14(2)31-34-23)18-11-15-7-6-10-17(25)19(15)24(33)32(18)16-8-4-3-5-9-16/h3-13H,1-2H3,(H3,26,27,28,29)/t13-/m0/s1
NCI pathway
Reactome pathway
US Patent
n/an/a 1n/an/an/an/an/a25
CALITOR SCIENCES, LLC; SUNSHINE LAKE PHARMA CO., LTD.
US Patent
Assay Description
PI3K (p110δ/p85α) (h) is incubated in assay buffer containing 10 μM phosphatidylinositol-4, 5-bisphosphate and MgATP (concentration as...
US Patent US9512114 (2016)
BindingDB Entry DOI: 10.7270/Q2TT4PWS
Phosphatidylinositol 4,5-bisphosphate 3-kinase catalytic subunit gamma isoform
(Homo sapiens (Human))
BDBM259449
(US9512114, 8 | US9657007, Example 8)
Show SMILES C[C@H](Nc1ncnc(N)c1-c1nc(C)no1)c1cc2cccc(Cl)c2c(=O)n1-c1ccccc1 |r|
Show InChI InChI=1S/C24H20ClN7O2/c1-13(29-22-20(21(26)27-12-28-22)23-30-14(2)31-34-23)18-11-15-7-6-10-17(25)19(15)24(33)32(18)16-8-4-3-5-9-16/h3-13H,1-2H3,(H3,26,27,28,29)/t13-/m0/s1
NCI pathway
Reactome pathway
US Patent
n/an/a 74n/an/an/an/an/an/a
CALITOR SCIENCES, LLC; SUNSHINE LAKE PHARMA CO., LTD.
US Patent
US Patent US9657007 (2017)
BindingDB Entry DOI: 10.7270/Q2J10574
Phosphatidylinositol 3-kinase regulatory subunit alpha
(Homo sapiens (Human))
BDBM259449
(US9512114, 8 | US9657007, Example 8)
Show SMILES C[C@H](Nc1ncnc(N)c1-c1nc(C)no1)c1cc2cccc(Cl)c2c(=O)n1-c1ccccc1 |r|
Show InChI InChI=1S/C24H20ClN7O2/c1-13(29-22-20(21(26)27-12-28-22)23-30-14(2)31-34-23)18-11-15-7-6-10-17(25)19(15)24(33)32(18)16-8-4-3-5-9-16/h3-13H,1-2H3,(H3,26,27,28,29)/t13-/m0/s1
US Patent
n/an/a 276n/an/an/an/an/an/a
CALITOR SCIENCES, LLC; SUNSHINE LAKE PHARMA CO., LTD.
US Patent
US Patent US9657007 (2017)
BindingDB Entry DOI: 10.7270/Q2J10574
Phosphatidylinositol 4,5-bisphosphate 3-kinase catalytic subunit beta isoform
(Homo sapiens (Human))
BDBM259449
(US9512114, 8 | US9657007, Example 8)
Show SMILES C[C@H](Nc1ncnc(N)c1-c1nc(C)no1)c1cc2cccc(Cl)c2c(=O)n1-c1ccccc1 |r|
Show InChI InChI=1S/C24H20ClN7O2/c1-13(29-22-20(21(26)27-12-28-22)23-30-14(2)31-34-23)18-11-15-7-6-10-17(25)19(15)24(33)32(18)16-8-4-3-5-9-16/h3-13H,1-2H3,(H3,26,27,28,29)/t13-/m0/s1
NCI pathway
Reactome pathway
US Patent
n/an/a 33n/an/an/an/an/an/a
CALITOR SCIENCES, LLC; SUNSHINE LAKE PHARMA CO., LTD.
US Patent
US Patent US9657007 (2017)
BindingDB Entry DOI: 10.7270/Q2J10574
Phosphatidylinositol 4,5-bisphosphate 3-kinase catalytic subunit delta isoform
(Homo sapiens (Human))
BDBM259449
(US9512114, 8 | US9657007, Example 8)
Show SMILES C[C@H](Nc1ncnc(N)c1-c1nc(C)no1)c1cc2cccc(Cl)c2c(=O)n1-c1ccccc1 |r|
Show InChI InChI=1S/C24H20ClN7O2/c1-13(29-22-20(21(26)27-12-28-22)23-30-14(2)31-34-23)18-11-15-7-6-10-17(25)19(15)24(33)32(18)16-8-4-3-5-9-16/h3-13H,1-2H3,(H3,26,27,28,29)/t13-/m0/s1
NCI pathway
Reactome pathway
US Patent
n/an/a 1n/an/an/an/an/an/a
CALITOR SCIENCES, LLC; SUNSHINE LAKE PHARMA CO., LTD.
US Patent
Assay Description
Kinase assays can be performed by measurement of incorporation of γ-33P ATP into immobilized myelin basic protein (MBP). High binding white 384 ...
US Patent US9657007 (2017)
BindingDB Entry DOI: 10.7270/Q2J10574
Phosphatidylinositol 4,5-bisphosphate 3-kinase catalytic subunit gamma isoform
(Homo sapiens (Human))
BDBM259449
(US9512114, 8 | US9657007, Example 8)
Show SMILES C[C@H](Nc1ncnc(N)c1-c1nc(C)no1)c1cc2cccc(Cl)c2c(=O)n1-c1ccccc1 |r|
Show InChI InChI=1S/C24H20ClN7O2/c1-13(29-22-20(21(26)27-12-28-22)23-30-14(2)31-34-23)18-11-15-7-6-10-17(25)19(15)24(33)32(18)16-8-4-3-5-9-16/h3-13H,1-2H3,(H3,26,27,28,29)/t13-/m0/s1
NCI pathway
Reactome pathway
US Patent
n/an/a 74n/an/an/an/an/a25
CALITOR SCIENCES, LLC; SUNSHINE LAKE PHARMA CO., LTD.
US Patent
Assay Description
PI3K (p120γ) (h) is incubated in assay buffer containing 10 μM phosphatidylinositol-4, 5-bisphosphate and MgATP (concentration as required)...
US Patent US9512114 (2016)
BindingDB Entry DOI: 10.7270/Q2TT4PWS