BDBM259476 US9512126, 15
SMILES: Cc1cc(ccc1C(=O)NC1CC1)-c1cnc2c(NCCC(F)(F)F)cc(nn12)C(=C)c1cccc(F)c1F
InChI Key: InChIKey=ALUVPLUSUAPJFE-UHFFFAOYSA-N
Data: 1 IC50
Activity Spreadsheet -- Enzyme Inhibition Constant Data from BindingDB
Found 1 hit for monomerid = 259476
Trg + Lig
Ki
nM
ΔG°
kcal/mole
IC50
nM
Kd
nM
EC50/IC50
nM
koff
s-1
kon
M-1s-1
pHTemp
°C
GST-Dual specificity protein kinase TTK
(Homo sapiens (Human))
BDBM259476
(US9512126, 15)
Show SMILES Cc1cc(ccc1C(=O)NC1CC1)-c1cnc2c(NCCC(F)(F)F)cc(nn12)C(=C)c1cccc(F)c1F
Show InChI InChI=1S/C28H24F5N5O/c1-15-12-17(6-9-19(15)27(39)36-18-7-8-18)24-14-35-26-23(34-11-10-28(31,32)33)13-22(37-38(24)26)16(2)20-4-3-5-21(29)25(20)30/h3-6,9,12-14,18,34H,2,7-8,10-11H2,1H3,(H,36,39)
US Patent
n/an/a 0.400n/an/an/an/a7.722
Bayer Intellectual Property GmbH
US Patent
Assay Description
The human kinase Mps-1 phosphorylates a biotinylated substrate peptide. Detection of the phosphorylated product is achieved by time-resolved fluoresc...
US Patent US9512126 (2016)
BindingDB Entry DOI: 10.7270/Q2Q23Z5S