BDBM259544 US9505749, 55
SMILES: O=C(CCCc1nc2ccccc2c(=O)[nH]1)N1CCN(CC1)c1n[nH]c2ccccc12
InChI Key: InChIKey=ABCZORPRBCURRK-UHFFFAOYSA-N
Data: 4 IC50
Activity Spreadsheet -- Enzyme Inhibition Constant Data from BindingDB
Found 4 hits for monomerid = 259544
Trg + Lig
Ki
nM
ΔG°
kcal/mole
IC50
nM
Kd
nM
EC50/IC50
nM
koff
s-1
kon
M-1s-1
pHTemp
°C
Poly [ADP-ribose] polymerase tankyrase-1 [1091-1325]
(Homo sapiens (Human))
BDBM259544
(US9505749, 55)
Show SMILES O=C(CCCc1nc2ccccc2c(=O)[nH]1)N1CCN(CC1)c1n[nH]c2ccccc12
Show InChI InChI=1S/C23H24N6O2/c30-21(11-5-10-20-24-18-8-3-2-7-17(18)23(31)25-20)28-12-14-29(15-13-28)22-16-6-1-4-9-19(16)26-27-22/h1-4,6-9H,5,10-15H2,(H,26,27)(H,24,25,31)
US Patent
n/an/a 1.76n/an/an/an/an/an/a
AMGEN INC.
US Patent
Assay Description
The tankyrase 1 biochemical activity of the compounds was assayed in the following assay buffer (50 mM MOPS pH7.5, 100 mM NaCl, 2.5 mM MgCl2, 0.01% T...
US Patent US9505749 (2016)
BindingDB Entry DOI: 10.7270/Q2FN154F
Poly [ADP-ribose] polymerase 2
(Homo sapiens (Human))
BDBM259544
(US9505749, 55)
Show SMILES O=C(CCCc1nc2ccccc2c(=O)[nH]1)N1CCN(CC1)c1n[nH]c2ccccc12
Show InChI InChI=1S/C23H24N6O2/c30-21(11-5-10-20-24-18-8-3-2-7-17(18)23(31)25-20)28-12-14-29(15-13-28)22-16-6-1-4-9-19(16)26-27-22/h1-4,6-9H,5,10-15H2,(H,26,27)(H,24,25,31)
US Patent
n/an/a 284n/an/an/an/an/an/a
AMGEN INC.
US Patent
Assay Description
PARP1 biochemical assay was purchased as a kit from Trevigen (cat.#4676-096-K) and used per manufacturers recommendations.PARP2 biochemical assay was...
US Patent US9505749 (2016)
BindingDB Entry DOI: 10.7270/Q2FN154F
Poly [ADP-ribose] polymerase 1
(Homo sapiens (Human))
BDBM259544
(US9505749, 55)
Show SMILES O=C(CCCc1nc2ccccc2c(=O)[nH]1)N1CCN(CC1)c1n[nH]c2ccccc12
Show InChI InChI=1S/C23H24N6O2/c30-21(11-5-10-20-24-18-8-3-2-7-17(18)23(31)25-20)28-12-14-29(15-13-28)22-16-6-1-4-9-19(16)26-27-22/h1-4,6-9H,5,10-15H2,(H,26,27)(H,24,25,31)
US Patent
n/an/a 1.80E+3n/an/an/an/an/an/a
AMGEN INC.
US Patent
Assay Description
PARP1 biochemical assay was purchased as a kit from Trevigen (cat.#4676-096-K) and used per manufacturers recommendations.PARP2 biochemical assay was...
US Patent US9505749 (2016)
BindingDB Entry DOI: 10.7270/Q2FN154F
Poly [ADP-ribose] polymerase tankyrase-2 [946-1162]
(Homo sapiens (Human))
BDBM259544
(US9505749, 55)
Show SMILES O=C(CCCc1nc2ccccc2c(=O)[nH]1)N1CCN(CC1)c1n[nH]c2ccccc12
Show InChI InChI=1S/C23H24N6O2/c30-21(11-5-10-20-24-18-8-3-2-7-17(18)23(31)25-20)28-12-14-29(15-13-28)22-16-6-1-4-9-19(16)26-27-22/h1-4,6-9H,5,10-15H2,(H,26,27)(H,24,25,31)
US Patent
n/an/a 0.401n/an/an/an/an/an/a
AMGEN INC.
US Patent
Assay Description
The tankyrase 1 biochemical activity of the compounds was assayed in the following assay buffer (50 mM MOPS pH7.5, 100 mM NaCl, 2.5 mM MgCl2, 0.01% T...
US Patent US9505749 (2016)
BindingDB Entry DOI: 10.7270/Q2FN154F