BDBM259574 US9505749, 85
SMILES: Clc1ccc2n([C@H]3CC[C@@H](CC3)NC(=O)CCc3nc4ccccc4c(=O)[nH]3)c(=O)[nH]c2c1
InChI Key:
Data: 4 IC50
Activity Spreadsheet -- Enzyme Inhibition Constant Data from BindingDB
Found 4 hits for monomerid = 259574
Trg + Lig
Ki
nM
ΔG°
kcal/mole
IC50
nM
Kd
nM
EC50/IC50
nM
koff
s-1
kon
M-1s-1
pHTemp
°C
Tankyrase-1
(Homo sapiens (Human))
BDBM259574
(US9505749, 85)
Show SMILES Clc1ccc2n([C@H]3CC[C@@H](CC3)NC(=O)CCc3nc4ccccc4c(=O)[nH]3)c(=O)[nH]c2c1 |r,wU:6.5,wD:9.12,(-.35,-6.38,;.74,-5.29,;.26,-3.82,;1.29,-2.68,;2.8,-3,;4.04,-2.09,;4.04,-.55,;2.71,.22,;2.71,1.76,;4.04,2.53,;5.38,1.76,;5.38,.22,;4.04,4.07,;2.71,4.84,;2.71,6.38,;1.38,4.07,;.04,4.84,;-1.29,4.07,;-2.62,4.84,;-3.96,4.07,;-5.29,4.84,;-6.62,4.07,;-6.62,2.53,;-5.29,1.76,;-3.96,2.53,;-2.62,1.76,;-2.62,.22,;-1.29,2.53,;5.29,-3,;6.62,-2.23,;4.81,-4.46,;3.27,-4.46,;2.24,-5.61,)|
US Patent
n/an/a 0.524n/an/an/an/an/an/a
AMGEN INC.
US Patent
Assay Description
The tankyrase 1 biochemical activity of the compounds was assayed in the following assay buffer (50 mM MOPS pH7.5, 100 mM NaCl, 2.5 mM MgCl2, 0.01% T...
US Patent US9505749 (2016)
BindingDB Entry DOI: 10.7270/Q2FN154F
Poly [ADP-ribose] polymerase 2
(Homo sapiens (Human))
BDBM259574
(US9505749, 85)
Show SMILES Clc1ccc2n([C@H]3CC[C@@H](CC3)NC(=O)CCc3nc4ccccc4c(=O)[nH]3)c(=O)[nH]c2c1 |r,wU:6.5,wD:9.12,(-.35,-6.38,;.74,-5.29,;.26,-3.82,;1.29,-2.68,;2.8,-3,;4.04,-2.09,;4.04,-.55,;2.71,.22,;2.71,1.76,;4.04,2.53,;5.38,1.76,;5.38,.22,;4.04,4.07,;2.71,4.84,;2.71,6.38,;1.38,4.07,;.04,4.84,;-1.29,4.07,;-2.62,4.84,;-3.96,4.07,;-5.29,4.84,;-6.62,4.07,;-6.62,2.53,;-5.29,1.76,;-3.96,2.53,;-2.62,1.76,;-2.62,.22,;-1.29,2.53,;5.29,-3,;6.62,-2.23,;4.81,-4.46,;3.27,-4.46,;2.24,-5.61,)|
US Patent
n/an/a 470n/an/an/an/an/an/a
AMGEN INC.
US Patent
Assay Description
PARP1 biochemical assay was purchased as a kit from Trevigen (cat.#4676-096-K) and used per manufacturers recommendations.PARP2 biochemical assay was...
US Patent US9505749 (2016)
BindingDB Entry DOI: 10.7270/Q2FN154F
Poly [ADP-ribose] polymerase 1
(Homo sapiens (Human))
BDBM259574
(US9505749, 85)
Show SMILES Clc1ccc2n([C@H]3CC[C@@H](CC3)NC(=O)CCc3nc4ccccc4c(=O)[nH]3)c(=O)[nH]c2c1 |r,wU:6.5,wD:9.12,(-.35,-6.38,;.74,-5.29,;.26,-3.82,;1.29,-2.68,;2.8,-3,;4.04,-2.09,;4.04,-.55,;2.71,.22,;2.71,1.76,;4.04,2.53,;5.38,1.76,;5.38,.22,;4.04,4.07,;2.71,4.84,;2.71,6.38,;1.38,4.07,;.04,4.84,;-1.29,4.07,;-2.62,4.84,;-3.96,4.07,;-5.29,4.84,;-6.62,4.07,;-6.62,2.53,;-5.29,1.76,;-3.96,2.53,;-2.62,1.76,;-2.62,.22,;-1.29,2.53,;5.29,-3,;6.62,-2.23,;4.81,-4.46,;3.27,-4.46,;2.24,-5.61,)|
US Patent
n/an/a>8.50E+4n/an/an/an/an/an/a
AMGEN INC.
US Patent
Assay Description
PARP1 biochemical assay was purchased as a kit from Trevigen (cat.#4676-096-K) and used per manufacturers recommendations.PARP2 biochemical assay was...
US Patent US9505749 (2016)
BindingDB Entry DOI: 10.7270/Q2FN154F
Tankyrase-2
(Homo sapiens (Human))
BDBM259574
(US9505749, 85)
Show SMILES Clc1ccc2n([C@H]3CC[C@@H](CC3)NC(=O)CCc3nc4ccccc4c(=O)[nH]3)c(=O)[nH]c2c1 |r,wU:6.5,wD:9.12,(-.35,-6.38,;.74,-5.29,;.26,-3.82,;1.29,-2.68,;2.8,-3,;4.04,-2.09,;4.04,-.55,;2.71,.22,;2.71,1.76,;4.04,2.53,;5.38,1.76,;5.38,.22,;4.04,4.07,;2.71,4.84,;2.71,6.38,;1.38,4.07,;.04,4.84,;-1.29,4.07,;-2.62,4.84,;-3.96,4.07,;-5.29,4.84,;-6.62,4.07,;-6.62,2.53,;-5.29,1.76,;-3.96,2.53,;-2.62,1.76,;-2.62,.22,;-1.29,2.53,;5.29,-3,;6.62,-2.23,;4.81,-4.46,;3.27,-4.46,;2.24,-5.61,)|
US Patent
n/an/a 0.227n/an/an/an/an/an/a
AMGEN INC.
US Patent
Assay Description
The tankyrase 1 biochemical activity of the compounds was assayed in the following assay buffer (50 mM MOPS pH7.5, 100 mM NaCl, 2.5 mM MgCl2, 0.01% T...
US Patent US9505749 (2016)
BindingDB Entry DOI: 10.7270/Q2FN154F