BDBM25972 3-{3-[12-methyl-8-(methylamino)-3-thia-1,7,10-triazatricyclo[7.3.0.0^{2,6}]dodeca-2(6),4,7,9,11-pentaen-4-yl]phenyl}propanamide::imidazothienopyrazine, 22p
SMILES: CNc1nc2cc(sc2n2c(C)cnc12)-c1cccc(CCC(N)=O)c1
InChI Key: InChIKey=AQXZEWPECUIPFQ-UHFFFAOYSA-N
Data: 3 IC50
Activity Spreadsheet -- Enzyme Inhibition Constant Data from BindingDB
Found 3 hits for monomerid = 25972
Trg + Lig
Ki
nM
ΔG°
kcal/mole
IC50
nM
Kd
nM
EC50/IC50
nM
koff
s-1
kon
M-1s-1
pHTemp
°C
Inhibitor of nuclear factor kappa-B kinase subunit alpha
(Homo sapiens (Human))
BDBM25972
(3-{3-[12-methyl-8-(methylamino)-3-thia-1,7,10-tria...)
Show SMILES CNc1nc2cc(sc2n2c(C)cnc12)-c1cccc(CCC(N)=O)c1
Show InChI InChI=1S/C19H19N5OS/c1-11-10-22-18-17(21-2)23-14-9-15(26-19(14)24(11)18)13-5-3-4-12(8-13)6-7-16(20)25/h3-5,8-10H,6-7H2,1-2H3,(H2,20,25)(H,21,23)
Reactome pathway
n/an/a 1.21E+3n/an/an/an/an/an/a
Bristol-Myers Squibb Company
Assay Description
Assays measuring the enzyme-catalyzed phosphorylation of GST-I kappa B alpha were performed. The phosphorylated substrate was detected using a Phosph...
Bioorg Med Chem Lett 17: 4284-9 (2007)
Article DOI: 10.1016/j.bmcl.2007.05.031
BindingDB Entry DOI: 10.7270/Q2QF8R50
Inhibitor of nuclear factor kappa-B kinase subunit beta
(Homo sapiens (Human))
BDBM25972
(3-{3-[12-methyl-8-(methylamino)-3-thia-1,7,10-tria...)
Show SMILES CNc1nc2cc(sc2n2c(C)cnc12)-c1cccc(CCC(N)=O)c1
Show InChI InChI=1S/C19H19N5OS/c1-11-10-22-18-17(21-2)23-14-9-15(26-19(14)24(11)18)13-5-3-4-12(8-13)6-7-16(20)25/h3-5,8-10H,6-7H2,1-2H3,(H2,20,25)(H,21,23)
NCI pathway
Reactome pathway
n/an/a 19n/an/an/an/an/an/a
China Pharmaceutical University
Curated by ChEMBL
Assay Description
Inhibition of human IKKbeta using GST-IkappaBalpha as substrate
Eur J Med Chem 63: 269-78 (2013)
Article DOI: 10.1016/j.ejmech.2013.01.045
BindingDB Entry DOI: 10.7270/Q2XG9SHG
Inhibitor of nuclear factor kappa-B kinase subunit beta
(Homo sapiens (Human))
BDBM25972
(3-{3-[12-methyl-8-(methylamino)-3-thia-1,7,10-tria...)
Show SMILES CNc1nc2cc(sc2n2c(C)cnc12)-c1cccc(CCC(N)=O)c1
Show InChI InChI=1S/C19H19N5OS/c1-11-10-22-18-17(21-2)23-14-9-15(26-19(14)24(11)18)13-5-3-4-12(8-13)6-7-16(20)25/h3-5,8-10H,6-7H2,1-2H3,(H2,20,25)(H,21,23)
NCI pathway
Reactome pathway
n/an/a 19n/an/an/an/an/an/a
Bristol-Myers Squibb Company
Assay Description
Assays measuring the enzyme-catalyzed phosphorylation of GST-I kappa B alpha were performed. The phosphorylated substrate was detected using a Phosph...
Bioorg Med Chem Lett 17: 4284-9 (2007)
Article DOI: 10.1016/j.bmcl.2007.05.031
BindingDB Entry DOI: 10.7270/Q2QF8R50