BDBM259926 US9512115, 30
SMILES: CC(F)(F)CCc1ccc([C@H]2COC(=O)N2c2ccc3[nH]cnc3c2)c(F)c1
InChI Key:
Data: 2 KI
Activity Spreadsheet -- Enzyme Inhibition Constant Data from BindingDB
Found 2 hits for monomerid = 259926
Trg + Lig
Ki
nM
ΔG°
kcal/mole
IC50
nM
Kd
nM
EC50/IC50
nM
koff
s-1
kon
M-1s-1
pHTemp
°C
Glutaminyl Cyclase
(Homo sapiens (Human))
BDBM259926
(US9512115, 30)
Show SMILES CC(F)(F)CCc1ccc([C@H]2COC(=O)N2c2ccc3[nH]cnc3c2)c(F)c1 |r|
US Patent
12.0 -11.0n/an/an/an/an/a6.030
PROBIODRUG AG
US Patent
Assay Description
All measurements were performed with a BioAssay Reader HTS-7000Plus for microplates (Perkin Elmer) at 30° C. QC activity was evaluated fluorometr...
US Patent US9512115 (2016)
BindingDB Entry DOI: 10.7270/Q2XK8DG4
Glutaminyl Cyclase
(Homo sapiens (Human))
BDBM259926
(US9512115, 30)
Show SMILES CC(F)(F)CCc1ccc([C@H]2COC(=O)N2c2ccc3[nH]cnc3c2)c(F)c1 |r|
US Patent
12.2 -11.0n/an/an/an/an/a8.030
PROBIODRUG AG
US Patent
Assay Description
All measurements were performed with a BioAssay Reader HTS-7000Plus for microplates (Perkin Elmer) at 30° C. QC activity was evaluated fluorometr...
US Patent US9512115 (2016)
BindingDB Entry DOI: 10.7270/Q2XK8DG4