BDBM260514 US9527851, 128::US9527851, example 128
SMILES: CN(C1C[C@H]2CN(C[C@H]2C1)C(=O)CO)c1ncnc2[nH]cc(F)c12
InChI Key:
Data: 6 IC50
Activity Spreadsheet -- Enzyme Inhibition Constant Data from BindingDB
Found 6 hits for monomerid = 260514
Trg + Lig
Ki
nM
ΔG°
kcal/mole
IC50
nM
Kd
nM
EC50/IC50
nM
koff
s-1
kon
M-1s-1
pHTemp
°C
Tyrosine-protein kinase JAK1
(Homo sapiens (Human))
BDBM260514
(US9527851, 128 | US9527851, example 128)
Show SMILES CN(C1C[C@H]2CN(C[C@H]2C1)C(=O)CO)c1ncnc2[nH]cc(F)c12 |r|
Reactome pathway
US Patent
n/an/a 13n/an/an/an/a7.327
Jiangsu Hengrui Medicine Co., Ltd.; Shanghai Hengrui Pharmaceutical Co., Ltd.
US Patent
Assay Description
In vitro kinase assays described below can be used to determine the activity of a test compound for inhibiting the activity of JAK1 kinase. The test ...
US Patent US9527851 (2016)
BindingDB Entry DOI: 10.7270/Q2HD7TM2
Tyrosine-protein kinase JAK2
(Homo sapiens (Human))
BDBM260514
(US9527851, 128 | US9527851, example 128)
Show SMILES CN(C1C[C@H]2CN(C[C@H]2C1)C(=O)CO)c1ncnc2[nH]cc(F)c12 |r|
Reactome pathway
US Patent
n/an/a 196n/an/an/an/a7.327
Jiangsu Hengrui Medicine Co., Ltd.; Shanghai Hengrui Pharmaceutical Co., Ltd.
US Patent
Assay Description
In vitro kinase assays described below can be used to determine the activity of a test compound for inhibiting the activity of JAK2 kinase. The test ...
US Patent US9527851 (2016)
BindingDB Entry DOI: 10.7270/Q2HD7TM2
Tyrosine-protein kinase JAK3
(Homo sapiens (Human))
BDBM260514
(US9527851, 128 | US9527851, example 128)
Show SMILES CN(C1C[C@H]2CN(C[C@H]2C1)C(=O)CO)c1ncnc2[nH]cc(F)c12 |r|
Reactome pathway
US Patent
n/an/a 4n/an/an/an/a7.325
Jiangsu Hengrui Medicine Co., Ltd.; Shanghai Hengrui Pharmaceutical Co., Ltd.
US Patent
Assay Description
TBDIn vitro kinase assays described below can be used to determine the activity of a test compound for inhibiting the activity of JAK3 kinase. The te...
US Patent US9527851 (2016)
BindingDB Entry DOI: 10.7270/Q2D21VRM
Tyrosine-protein kinase JAK1
(Homo sapiens (Human))
BDBM260514
(US9527851, 128 | US9527851, example 128)
Show SMILES CN(C1C[C@H]2CN(C[C@H]2C1)C(=O)CO)c1ncnc2[nH]cc(F)c12 |r|
Reactome pathway
US Patent
n/an/a 13n/an/an/an/a7.325
Jiangsu Hengrui Medicine Co., Ltd.; Shanghai Hengrui Pharmaceutical Co., Ltd.
US Patent
Assay Description
TBDIn vitro kinase assays described below can be used to determine the activity of a test compound for inhibiting the activity of JAK1 kinase. The te...
US Patent US9527851 (2016)
BindingDB Entry DOI: 10.7270/Q2D21VRM
Tyrosine-protein kinase JAK2
(Homo sapiens (Human))
BDBM260514
(US9527851, 128 | US9527851, example 128)
Show SMILES CN(C1C[C@H]2CN(C[C@H]2C1)C(=O)CO)c1ncnc2[nH]cc(F)c12 |r|
Reactome pathway
US Patent
n/an/a 196n/an/an/an/a7.325
Jiangsu Hengrui Medicine Co., Ltd.; Shanghai Hengrui Pharmaceutical Co., Ltd.
US Patent
Assay Description
In vitro kinase assays described below can be used to determine the activity of a test compound for inhibiting the activity of JAK2 kinase. The test ...
US Patent US9527851 (2016)
BindingDB Entry DOI: 10.7270/Q2D21VRM
Tyrosine-protein kinase JAK3
(Homo sapiens (Human))
BDBM260514
(US9527851, 128 | US9527851, example 128)
Show SMILES CN(C1C[C@H]2CN(C[C@H]2C1)C(=O)CO)c1ncnc2[nH]cc(F)c12 |r|
Reactome pathway
US Patent
n/an/a 4n/an/an/an/a7.327
Jiangsu Hengrui Medicine Co., Ltd.; Shanghai Hengrui Pharmaceutical Co., Ltd.
US Patent
Assay Description
In vitro kinase assays described below can be used to determine the activity of a test compound for inhibiting the activity of JAK3 kinase. The test ...
US Patent US9527851 (2016)
BindingDB Entry DOI: 10.7270/Q2HD7TM2