BDBM260651 US9533985, 39
SMILES: Cn1c2cnccc2c(=O)n(-c2ccc(C[C@H](NC(=O)c3ccc(NS(=O)(=O)c4ccncc4)cc3F)C(O)=O)cc2)c1=O
InChI Key: InChIKey=MIQVLHFYIZFKSQ-DEOSSOPVSA-N
Data: 3 IC50
Activity Spreadsheet -- Enzyme Inhibition Constant Data from BindingDB
Found 3 hits for monomerid = 260651
Trg + Lig
Ki
nM
ΔG°
kcal/mole
IC50
nM
Kd
nM
EC50/IC50
nM
koff
s-1
kon
M-1s-1
pHTemp
°C
Mucosal addressin cell adhesion molecule 1 (MAdCAM-1)/Alpha-4 Beta-7 Integrin
(Mus musculus (Mouse)-Homo sapiens (Human))
BDBM260651
(US9533985, 39)
Show SMILES Cn1c2cnccc2c(=O)n(-c2ccc(C[C@H](NC(=O)c3ccc(NS(=O)(=O)c4ccncc4)cc3F)C(O)=O)cc2)c1=O |r|
Show InChI InChI=1S/C29H23FN6O7S/c1-35-25-16-32-13-10-22(25)27(38)36(29(35)41)19-5-2-17(3-6-19)14-24(28(39)40)33-26(37)21-7-4-18(15-23(21)30)34-44(42,43)20-8-11-31-12-9-20/h2-13,15-16,24,34H,14H2,1H3,(H,33,37)(H,39,40)/t24-/m0/s1
US Patent
n/an/a 0.830n/an/an/an/a9.64
EA Pharma Co., Ltd.
US Patent
Assay Description
The ability of test substances to inhibit the binding of a human B cell line, RPMI-8866, which is known to express α4β7 integrin, to MAdCA...
US Patent US9533985 (2017)
BindingDB Entry DOI: 10.7270/Q20C4TQ8
Mucosal addressin cell adhesion molecule 1 (MAdCAM-1)/Alpha-4 Beta-7 Integrin
(Mus musculus (Mouse)-Homo sapiens (Human))
BDBM260651
(US9533985, 39)
Show SMILES Cn1c2cnccc2c(=O)n(-c2ccc(C[C@H](NC(=O)c3ccc(NS(=O)(=O)c4ccncc4)cc3F)C(O)=O)cc2)c1=O |r|
Show InChI InChI=1S/C29H23FN6O7S/c1-35-25-16-32-13-10-22(25)27(38)36(29(35)41)19-5-2-17(3-6-19)14-24(28(39)40)33-26(37)21-7-4-18(15-23(21)30)34-44(42,43)20-8-11-31-12-9-20/h2-13,15-16,24,34H,14H2,1H3,(H,33,37)(H,39,40)/t24-/m0/s1
US Patent
n/an/a 27n/an/an/an/a9.64
EA Pharma Co., Ltd.
US Patent
Assay Description
The ability of test substances to inhibit the binding of a human B cell line, RPMI-8866, which is known to express α4β7 integrin, to MAdCA...
US Patent US9533985 (2017)
BindingDB Entry DOI: 10.7270/Q20C4TQ8
Vascular cell adhesion protein 1 (VCAM-1)/Alpha-4 Beta-1 Integrin
(Homo sapiens (Human))
BDBM260651
(US9533985, 39)
Show SMILES Cn1c2cnccc2c(=O)n(-c2ccc(C[C@H](NC(=O)c3ccc(NS(=O)(=O)c4ccncc4)cc3F)C(O)=O)cc2)c1=O |r|
Show InChI InChI=1S/C29H23FN6O7S/c1-35-25-16-32-13-10-22(25)27(38)36(29(35)41)19-5-2-17(3-6-19)14-24(28(39)40)33-26(37)21-7-4-18(15-23(21)30)34-44(42,43)20-8-11-31-12-9-20/h2-13,15-16,24,34H,14H2,1H3,(H,33,37)(H,39,40)/t24-/m0/s1
US Patent
n/an/a 140n/an/an/an/a9.64
EA Pharma Co., Ltd.
US Patent
Assay Description
The ability of test substances to inhibit the binding of a human T-cell line, Jurkat, which is known to express α4β1 integrin, to VCAM-1 w...
US Patent US9533985 (2017)
BindingDB Entry DOI: 10.7270/Q20C4TQ8