BDBM260656 US9533985, 44
SMILES: CCNC(=O)c1ccc(cc1)S(=O)(=O)Nc1cc(F)c(C(=O)N[C@@H](Cc2ccc(cc2)-n2c(=O)ccn(C)c2=O)C(O)=O)c(F)c1
InChI Key: InChIKey=XMUQMOVIUQVKPD-DEOSSOPVSA-N
Data: 3 IC50
Activity Spreadsheet -- Enzyme Inhibition Constant Data from BindingDB
Found 3 hits for monomerid = 260656
Trg + Lig
Ki
nM
ΔG°
kcal/mole
IC50
nM
Kd
nM
EC50/IC50
nM
koff
s-1
kon
M-1s-1
pHTemp
°C
Mucosal addressin cell adhesion molecule 1 (MAdCAM-1)/Alpha-4 Beta-7 Integrin
(Mus musculus (Mouse)-Homo sapiens (Human))
BDBM260656
(US9533985, 44)
Show SMILES CCNC(=O)c1ccc(cc1)S(=O)(=O)Nc1cc(F)c(C(=O)N[C@@H](Cc2ccc(cc2)-n2c(=O)ccn(C)c2=O)C(O)=O)c(F)c1 |r|
Show InChI InChI=1S/C30H27F2N5O8S/c1-3-33-27(39)18-6-10-21(11-7-18)46(44,45)35-19-15-22(31)26(23(32)16-19)28(40)34-24(29(41)42)14-17-4-8-20(9-5-17)37-25(38)12-13-36(2)30(37)43/h4-13,15-16,24,35H,3,14H2,1-2H3,(H,33,39)(H,34,40)(H,41,42)/t24-/m0/s1
US Patent
n/an/a 0.620n/an/an/an/a9.64
EA Pharma Co., Ltd.
US Patent
Assay Description
The ability of test substances to inhibit the binding of a human B cell line, RPMI-8866, which is known to express α4β7 integrin, to MAdCA...
US Patent US9533985 (2017)
BindingDB Entry DOI: 10.7270/Q20C4TQ8
Mucosal addressin cell adhesion molecule 1 (MAdCAM-1)/Alpha-4 Beta-7 Integrin
(Mus musculus (Mouse)-Homo sapiens (Human))
BDBM260656
(US9533985, 44)
Show SMILES CCNC(=O)c1ccc(cc1)S(=O)(=O)Nc1cc(F)c(C(=O)N[C@@H](Cc2ccc(cc2)-n2c(=O)ccn(C)c2=O)C(O)=O)c(F)c1 |r|
Show InChI InChI=1S/C30H27F2N5O8S/c1-3-33-27(39)18-6-10-21(11-7-18)46(44,45)35-19-15-22(31)26(23(32)16-19)28(40)34-24(29(41)42)14-17-4-8-20(9-5-17)37-25(38)12-13-36(2)30(37)43/h4-13,15-16,24,35H,3,14H2,1-2H3,(H,33,39)(H,34,40)(H,41,42)/t24-/m0/s1
US Patent
n/an/a 16n/an/an/an/a9.64
EA Pharma Co., Ltd.
US Patent
Assay Description
The ability of test substances to inhibit the binding of a human B cell line, RPMI-8866, which is known to express α4β7 integrin, to MAdCA...
US Patent US9533985 (2017)
BindingDB Entry DOI: 10.7270/Q20C4TQ8
Vascular cell adhesion protein 1 (VCAM-1)/Alpha-4 Beta-1 Integrin
(Homo sapiens (Human))
BDBM260656
(US9533985, 44)
Show SMILES CCNC(=O)c1ccc(cc1)S(=O)(=O)Nc1cc(F)c(C(=O)N[C@@H](Cc2ccc(cc2)-n2c(=O)ccn(C)c2=O)C(O)=O)c(F)c1 |r|
Show InChI InChI=1S/C30H27F2N5O8S/c1-3-33-27(39)18-6-10-21(11-7-18)46(44,45)35-19-15-22(31)26(23(32)16-19)28(40)34-24(29(41)42)14-17-4-8-20(9-5-17)37-25(38)12-13-36(2)30(37)43/h4-13,15-16,24,35H,3,14H2,1-2H3,(H,33,39)(H,34,40)(H,41,42)/t24-/m0/s1
US Patent
n/an/a 160n/an/an/an/a9.64
EA Pharma Co., Ltd.
US Patent
Assay Description
The ability of test substances to inhibit the binding of a human T-cell line, Jurkat, which is known to express α4β1 integrin, to VCAM-1 w...
US Patent US9533985 (2017)
BindingDB Entry DOI: 10.7270/Q20C4TQ8