BDBM260928 US9540323, 119::US9540323, example 119
SMILES: Cc1cc(cnc1F)-c1ccc(O)c2N(CC(C)(C)c12)c1ccccc1NC(=O)Nc1ccc(OC(F)(F)F)cc1
InChI Key: InChIKey=UMDSMPFSQWKRFJ-UHFFFAOYSA-N
Data: 1 KI
Activity Spreadsheet -- Enzyme Inhibition Constant Data from BindingDB
Found 1 hit for monomerid = 260928
Trg + Lig
Ki
nM
ΔG°
kcal/mole
IC50
nM
Kd
nM
EC50/IC50
nM
koff
s-1
kon
M-1s-1
pHTemp
°C
Purinergic receptor P2Y1
(Homo sapiens (Human))
BDBM260928
(US9540323, 119 | US9540323, example 119)
Show SMILES Cc1cc(cnc1F)-c1ccc(O)c2N(CC(C)(C)c12)c1ccccc1NC(=O)Nc1ccc(OC(F)(F)F)cc1
Show InChI InChI=1S/C30H26F4N4O3/c1-17-14-18(15-35-27(17)31)21-12-13-24(39)26-25(21)29(2,3)16-38(26)23-7-5-4-6-22(23)37-28(40)36-19-8-10-20(11-9-19)41-30(32,33)34/h4-15,39H,16H2,1-3H3,(H2,36,37,40)
US Patent
3.30 -11.6n/an/an/an/an/a7.425
Bristol-Myers Squibb Company
US Patent
Assay Description
A SPA membrane binding assay was used to identify inhibitors of [33P] 2MeS-ADP binding to cloned human P2Y1 receptors (The P2Y1 receptor membranes we...
US Patent US9540323 (2017)
BindingDB Entry DOI: 10.7270/Q289141P