BDBM260973 US9540323, 174::US9540323, example 174
SMILES: CC1(C)CN(c2c1c(ccc2O)-c1nc2ccc(F)cc2s1)c1ccccc1NC(=O)Nc1ccc(OC(F)(F)F)cc1
InChI Key: InChIKey=QQRPULPPWHUFPW-UHFFFAOYSA-N
Data: 1 KI
Activity Spreadsheet -- Enzyme Inhibition Constant Data from BindingDB
Found 1 hit for monomerid = 260973
Trg + Lig
Ki
nM
ΔG°
kcal/mole
IC50
nM
Kd
nM
EC50/IC50
nM
koff
s-1
kon
M-1s-1
pHTemp
°C
Purinergic receptor P2Y1
(Homo sapiens (Human))
BDBM260973
(US9540323, 174 | US9540323, example 174)
Show SMILES CC1(C)CN(c2c1c(ccc2O)-c1nc2ccc(F)cc2s1)c1ccccc1NC(=O)Nc1ccc(OC(F)(F)F)cc1
Show InChI InChI=1S/C31H24F4N4O3S/c1-30(2)16-39(27-24(40)14-12-20(26(27)30)28-37-22-13-7-17(32)15-25(22)43-28)23-6-4-3-5-21(23)38-29(41)36-18-8-10-19(11-9-18)42-31(33,34)35/h3-15,40H,16H2,1-2H3,(H2,36,38,41)
US Patent
6.30 -11.2n/an/an/an/an/a7.425
Bristol-Myers Squibb Company
US Patent
Assay Description
A SPA membrane binding assay was used to identify inhibitors of [33P] 2MeS-ADP binding to cloned human P2Y1 receptors (The P2Y1 receptor membranes we...
US Patent US9540323 (2017)
BindingDB Entry DOI: 10.7270/Q289141P