BDBM261 (S)-5-{[5-(1-Carboxymethyl-2-oxo-ethylcarbamoyl)-furan-2-ylmethyl]sulfamoyl}-2-hydroxy-benzoic Acid::5-{[(5-{[(2S)-1-carboxy-3-oxopropan-2-yl]carbamoyl}furan-2-yl)methyl]sulfamoyl}-2-hydroxybenzoic acid::Heterocyclic deriv. 70a::Inhibitor 70a
SMILES: OC(=O)C[C@H](NC(=O)c1ccc(CNS(=O)(=O)c2ccc(O)c(c2)C(O)=O)o1)C=O
InChI Key: InChIKey=LKRGLBXFALOHLE-VIFPVBQESA-N
Data: 1 KI
Activity Spreadsheet -- Enzyme Inhibition Constant Data from BindingDB
Found 1 hit for monomerid = 261
Trg + Lig
Ki
nM
ΔG°
kcal/mole
IC50
nM
Kd
nM
EC50/IC50
nM
koff
s-1
kon
M-1s-1
pHTemp
°C
Caspase-3
(Homo sapiens (Human))
BDBM261
((S)-5-{[5-(1-Carboxymethyl-2-oxo-ethylcarbamoyl)-f...)
Show SMILES OC(=O)C[C@H](NC(=O)c1ccc(CNS(=O)(=O)c2ccc(O)c(c2)C(O)=O)o1)C=O |r|
Show InChI InChI=1S/C17H16N2O10S/c20-8-9(5-15(22)23)19-16(24)14-4-1-10(29-14)7-18-30(27,28)11-2-3-13(21)12(6-11)17(25)26/h1-4,6,8-9,18,21H,5,7H2,(H,19,24)(H,22,23)(H,25,26)/t9-/m0/s1
NCI pathway
Reactome pathway
1.25E+4 -6.68n/an/an/an/an/a7.425
Sunesis Pharmaceuticals
Assay Description
The effectiveness of compounds against the activity of human recombinant caspase-1-8 was measured using fluorometric assays. Assays were carried out ...
J Med Chem 45: 5005-22 (2002)
Article DOI: 10.1021/jm020230j
BindingDB Entry DOI: 10.7270/Q2B56GW5