null
SMILES: COc1c(cc(Cl)c(C)c1-c1cncc(c1)C(=O)N1CCC(O)CC1)C(C)n1nc(C)c2c(N)ncnc12
InChI Key: InChIKey=FFHNSAHWOCYDHQ-UHFFFAOYSA-N
Activity Spreadsheet -- Enzyme Inhibition Constant Data from BindingDB
Found 6 hits for monomerid = 261153
Trg + Lig
Ki
nM
ΔG°
kcal/mole
IC50
nM
Kd
nM
EC50/IC50
nM
koff
s-1
kon
M-1s-1
pHTemp
°C
Phosphatidylinositol 4,5-bisphosphate 3-kinase catalytic subunit beta/delta isoform
(Homo sapiens (Human))
BDBM261153
(1-[(5-{3-[1-(4-amino-3-methyl-1H- pyrazolo[3,4-d]p...)
Show SMILES COc1c(cc(Cl)c(C)c1-c1cncc(c1)C(=O)N1CCC(O)CC1)C(C)n1nc(C)c2c(N)ncnc12
Show InChI InChI=1S/C27H30ClN7O3/c1-14-21(28)10-20(16(3)35-26-23(15(2)33-35)25(29)31-13-32-26)24(38-4)22(14)17-9-18(12-30-11-17)27(37)34-7-5-19(36)6-8-34/h9-13,16,19,36H,5-8H2,1-4H3,(H2,29,31,32)
US Patent
n/an/a<10n/an/an/an/a6.725
Incyte Holdings Corporation; Incyte Corporation
US Patent
Assay Description
Lipid kinase substrate, phosphoinositol-4,5-bisphosphate (PIP2), are purchased from Echelon Biosciences (Salt Lake City, Utah). PI3K isoforms α,...
US Patent US9707233 (2017)
BindingDB Entry DOI: 10.7270/Q2S46V0R
Phosphatidylinositol 4,5-bisphosphate 3-kinase catalytic subunit delta isoform
(Homo sapiens (Human))
BDBM261153
(1-[(5-{3-[1-(4-amino-3-methyl-1H- pyrazolo[3,4-d]p...)
Show SMILES COc1c(cc(Cl)c(C)c1-c1cncc(c1)C(=O)N1CCC(O)CC1)C(C)n1nc(C)c2c(N)ncnc12
Show InChI InChI=1S/C27H30ClN7O3/c1-14-21(28)10-20(16(3)35-26-23(15(2)33-35)25(29)31-13-32-26)24(38-4)22(14)17-9-18(12-30-11-17)27(37)34-7-5-19(36)6-8-34/h9-13,16,19,36H,5-8H2,1-4H3,(H2,29,31,32)
NCI pathway
Reactome pathway
US Patent
n/an/a<10n/an/an/an/a6.725
Incyte Holdings Corporation; Incyte Corporation
US Patent
Assay Description
[γ-33P]ATP (10 mCi/mL) was purchased from Perkin-Elmer (Waltham, Mass.). Lipid kinase substrate, D-myo-Phosphatidylinositol 4,5-bisphosphate (Pt...
US Patent US10092570 (2018)
BindingDB Entry DOI: 10.7270/Q2PZ5BW5
Phosphatidylinositol 4,5-bisphosphate 3-kinase catalytic subunit delta isoform
(Homo sapiens (Human))
US11433071, Example 176
(1-[(5-{3-[1-(4-amino-3-methyl-1H- pyrazolo[3,4-d]p...)
Show SMILES COc1c(cc(Cl)c(C)c1-c1cncc(c1)C(=O)N1CCC(O)CC1)C(C)n1nc(C)c2c(N)ncnc12
Show InChI InChI=1S/C27H30ClN7O3/c1-14-21(28)10-20(16(3)35-26-23(15(2)33-35)25(29)31-13-32-26)24(38-4)22(14)17-9-18(12-30-11-17)27(37)34-7-5-19(36)6-8-34/h9-13,16,19,36H,5-8H2,1-4H3,(H2,29,31,32)
NCI pathway
Reactome pathway
n/an/a<10n/an/an/an/an/an/a
TBA
Citation and Details
Phosphatidylinositol 4,5-bisphosphate 3-kinase catalytic subunit delta isoform
(Homo sapiens (Human))
BDBM261153
(1-[(5-{3-[1-(4-amino-3-methyl-1H- pyrazolo[3,4-d]p...)
Show SMILES COc1c(cc(Cl)c(C)c1-c1cncc(c1)C(=O)N1CCC(O)CC1)C(C)n1nc(C)c2c(N)ncnc12
Show InChI InChI=1S/C27H30ClN7O3/c1-14-21(28)10-20(16(3)35-26-23(15(2)33-35)25(29)31-13-32-26)24(38-4)22(14)17-9-18(12-30-11-17)27(37)34-7-5-19(36)6-8-34/h9-13,16,19,36H,5-8H2,1-4H3,(H2,29,31,32)
NCI pathway
Reactome pathway
US Patent
n/an/a<10n/an/an/an/an/an/a
Incyte Holdings Corporation
US Patent
Assay Description
[γ-33P]ATP (10 mCi/mL) was purchased from Perkin-Elmer (Waltham, Mass.). Lipid kinase substrate, D-myo-Phosphatidylinositol 4,5-bisphosphate (Pt...
US Patent US10376513 (2019)
BindingDB Entry DOI: 10.7270/Q2GQ7142
Phosphatidylinositol 4,5-bisphosphate 3-kinase catalytic subunit delta isoform
(Homo sapiens (Human))
BDBM261153
(1-[(5-{3-[1-(4-amino-3-methyl-1H- pyrazolo[3,4-d]p...)
Show SMILES COc1c(cc(Cl)c(C)c1-c1cncc(c1)C(=O)N1CCC(O)CC1)C(C)n1nc(C)c2c(N)ncnc12
Show InChI InChI=1S/C27H30ClN7O3/c1-14-21(28)10-20(16(3)35-26-23(15(2)33-35)25(29)31-13-32-26)24(38-4)22(14)17-9-18(12-30-11-17)27(37)34-7-5-19(36)6-8-34/h9-13,16,19,36H,5-8H2,1-4H3,(H2,29,31,32)
NCI pathway
Reactome pathway
US Patent
n/an/a<10n/an/an/an/an/an/a
Incyte Corporation; Incyte Holdings Corporation
US Patent
Assay Description
The kinase reaction was conducted in polystyrene 384-well matrix white plate from Thermo Fisher Scientific in a final volume of 25 uL. Inhibitors wer...
US Patent US10646492 (2020)
Phosphatidylinositol 4,5-bisphosphate 3-kinase catalytic subunit delta isoform
(Homo sapiens (Human))
BDBM261153
(1-[(5-{3-[1-(4-amino-3-methyl-1H- pyrazolo[3,4-d]p...)
Show SMILES COc1c(cc(Cl)c(C)c1-c1cncc(c1)C(=O)N1CCC(O)CC1)C(C)n1nc(C)c2c(N)ncnc12
Show InChI InChI=1S/C27H30ClN7O3/c1-14-21(28)10-20(16(3)35-26-23(15(2)33-35)25(29)31-13-32-26)24(38-4)22(14)17-9-18(12-30-11-17)27(37)34-7-5-19(36)6-8-34/h9-13,16,19,36H,5-8H2,1-4H3,(H2,29,31,32)
NCI pathway
Reactome pathway
US Patent
n/an/a<10n/an/an/an/an/an/a
Incyte Holdings Corporation; Incyte Corporation
US Patent
Assay Description
[γ-33P]ATP (10 mCi/mL) was purchased from PerkinElmer (Waltham, Mass.). Lipid kinase substrate, D-myo-Phosphatidylinositol 4,5-bisphosphate (Ptd...
US Patent US9730939 (2017)
BindingDB Entry DOI: 10.7270/Q2GB265W