null
SMILES: COc1c(cc(Cl)c(C)c1CCC(=O)N(C)C)C(C)n1nc(C)c2c(N)ncnc12
InChI Key: InChIKey=RJDWLJPCXGVXSN-UHFFFAOYSA-N
Activity Spreadsheet -- Enzyme Inhibition Constant Data from BindingDB
Found 6 hits for monomerid = 261157
Trg + Lig
Ki
nM
ΔG°
kcal/mole
IC50
nM
Kd
nM
EC50/IC50
nM
koff
s-1
kon
M-1s-1
pHTemp
°C
Phosphatidylinositol 4,5-bisphosphate 3-kinase catalytic subunit beta/delta isoform
(Homo sapiens (Human))
BDBM261157
(3-(3-(1-(4-Amino-3-methyl-1H- pyrazolo[3,4-d]pyrim...)
Show SMILES COc1c(cc(Cl)c(C)c1CCC(=O)N(C)C)C(C)n1nc(C)c2c(N)ncnc12
Show InChI InChI=1S/C21H27ClN6O2/c1-11-14(7-8-17(29)27(4)5)19(30-6)15(9-16(11)22)13(3)28-21-18(12(2)26-28)20(23)24-10-25-21/h9-10,13H,7-8H2,1-6H3,(H2,23,24,25)
US Patent
n/an/a<10n/an/an/an/a6.725
Incyte Holdings Corporation; Incyte Corporation
US Patent
Assay Description
Lipid kinase substrate, phosphoinositol-4,5-bisphosphate (PIP2), are purchased from Echelon Biosciences (Salt Lake City, Utah). PI3K isoforms α,...
US Patent US9707233 (2017)
BindingDB Entry DOI: 10.7270/Q2S46V0R
Phosphatidylinositol 4,5-bisphosphate 3-kinase catalytic subunit delta isoform
(Homo sapiens (Human))
BDBM261157
(3-(3-(1-(4-Amino-3-methyl-1H- pyrazolo[3,4-d]pyrim...)
Show SMILES COc1c(cc(Cl)c(C)c1CCC(=O)N(C)C)C(C)n1nc(C)c2c(N)ncnc12
Show InChI InChI=1S/C21H27ClN6O2/c1-11-14(7-8-17(29)27(4)5)19(30-6)15(9-16(11)22)13(3)28-21-18(12(2)26-28)20(23)24-10-25-21/h9-10,13H,7-8H2,1-6H3,(H2,23,24,25)
NCI pathway
Reactome pathway
US Patent
n/an/a<10n/an/an/an/a6.725
Incyte Holdings Corporation; Incyte Corporation
US Patent
Assay Description
[γ-33P]ATP (10 mCi/mL) was purchased from Perkin-Elmer (Waltham, Mass.). Lipid kinase substrate, D-myo-Phosphatidylinositol 4,5-bisphosphate (Pt...
US Patent US10092570 (2018)
BindingDB Entry DOI: 10.7270/Q2PZ5BW5
Phosphatidylinositol 4,5-bisphosphate 3-kinase catalytic subunit delta isoform
(Homo sapiens (Human))
BDBM261157
(3-(3-(1-(4-Amino-3-methyl-1H- pyrazolo[3,4-d]pyrim...)
Show SMILES COc1c(cc(Cl)c(C)c1CCC(=O)N(C)C)C(C)n1nc(C)c2c(N)ncnc12
Show InChI InChI=1S/C21H27ClN6O2/c1-11-14(7-8-17(29)27(4)5)19(30-6)15(9-16(11)22)13(3)28-21-18(12(2)26-28)20(23)24-10-25-21/h9-10,13H,7-8H2,1-6H3,(H2,23,24,25)
NCI pathway
Reactome pathway
US Patent
n/an/a<10n/an/an/an/an/an/a
TBA
Assay Description
The kinase reaction was conducted in polystyrene 384-well matrix white plate from Thermo Fisher Scientific in a final volume of 25 μL. Inhibitor...
Citation and Details
BindingDB Entry DOI: 10.7270/Q2417199
Phosphatidylinositol 4,5-bisphosphate 3-kinase catalytic subunit delta isoform
(Homo sapiens (Human))
BDBM261157
(3-(3-(1-(4-Amino-3-methyl-1H- pyrazolo[3,4-d]pyrim...)
Show SMILES COc1c(cc(Cl)c(C)c1CCC(=O)N(C)C)C(C)n1nc(C)c2c(N)ncnc12
Show InChI InChI=1S/C21H27ClN6O2/c1-11-14(7-8-17(29)27(4)5)19(30-6)15(9-16(11)22)13(3)28-21-18(12(2)26-28)20(23)24-10-25-21/h9-10,13H,7-8H2,1-6H3,(H2,23,24,25)
NCI pathway
Reactome pathway
US Patent
n/an/a<10n/an/an/an/an/an/a
Incyte Holdings Corporation
US Patent
Assay Description
[γ-33P]ATP (10 mCi/mL) was purchased from Perkin-Elmer (Waltham, Mass.). Lipid kinase substrate, D-myo-Phosphatidylinositol 4,5-bisphosphate (Pt...
US Patent US10376513 (2019)
BindingDB Entry DOI: 10.7270/Q2GQ7142
Phosphatidylinositol 4,5-bisphosphate 3-kinase catalytic subunit delta isoform
(Homo sapiens (Human))
BDBM261157
(3-(3-(1-(4-Amino-3-methyl-1H- pyrazolo[3,4-d]pyrim...)
Show SMILES COc1c(cc(Cl)c(C)c1CCC(=O)N(C)C)C(C)n1nc(C)c2c(N)ncnc12
Show InChI InChI=1S/C21H27ClN6O2/c1-11-14(7-8-17(29)27(4)5)19(30-6)15(9-16(11)22)13(3)28-21-18(12(2)26-28)20(23)24-10-25-21/h9-10,13H,7-8H2,1-6H3,(H2,23,24,25)
NCI pathway
Reactome pathway
US Patent
n/an/a<10n/an/an/an/an/an/a
Incyte Corporation; Incyte Holdings Corporation
US Patent
Assay Description
The kinase reaction was conducted in polystyrene 384-well matrix white plate from Thermo Fisher Scientific in a final volume of 25 uL. Inhibitors wer...
US Patent US10646492 (2020)
BindingDB Entry DOI: 10.7270/Q2125WP7
Phosphatidylinositol 4,5-bisphosphate 3-kinase catalytic subunit delta isoform
(Homo sapiens (Human))
BDBM261157
(3-(3-(1-(4-Amino-3-methyl-1H- pyrazolo[3,4-d]pyrim...)
Show SMILES COc1c(cc(Cl)c(C)c1CCC(=O)N(C)C)C(C)n1nc(C)c2c(N)ncnc12
Show InChI InChI=1S/C21H27ClN6O2/c1-11-14(7-8-17(29)27(4)5)19(30-6)15(9-16(11)22)13(3)28-21-18(12(2)26-28)20(23)24-10-25-21/h9-10,13H,7-8H2,1-6H3,(H2,23,24,25)
NCI pathway
Reactome pathway
US Patent
n/an/a<10n/an/an/an/an/an/a
Incyte Holdings Corporation; Incyte Corporation
US Patent
Assay Description
[γ-33P]ATP (10 mCi/mL) was purchased from PerkinElmer (Waltham, Mass.). Lipid kinase substrate, D-myo-Phosphatidylinositol 4,5-bisphosphate (Ptd...
US Patent US9730939 (2017)
BindingDB Entry DOI: 10.7270/Q2GB265W