null
SMILES: CCOc1c(cc(Cl)c(C)c1-c1ccc(cn1)C(=O)N(C)C)C(C)Nc1ncnc(N)c1C(C)=N
InChI Key: InChIKey=WWWLCQHFGIAHBY-UHFFFAOYSA-N
Activity Spreadsheet -- Enzyme Inhibition Constant Data from BindingDB
Found 4 hits for monomerid = 261185
Trg + Lig
Ki
nM
ΔG°
kcal/mole
IC50
nM
Kd
nM
EC50/IC50
nM
koff
s-1
kon
M-1s-1
pHTemp
°C
Phosphatidylinositol 4,5-bisphosphate 3-kinase catalytic subunit beta/delta isoform
(Homo sapiens (Human))
BDBM261185
(6-{3-[1-(4-Amino-3-methyl-1H-pyrazolo[3,4-d]pyrimi...)
Show SMILES CCOc1c(cc(Cl)c(C)c1-c1ccc(cn1)C(=O)N(C)C)C(C)Nc1ncnc(N)c1C(C)=N
Show InChI InChI=1S/C25H30ClN7O2/c1-7-35-22-17(15(4)32-24-21(14(3)27)23(28)30-12-31-24)10-18(26)13(2)20(22)19-9-8-16(11-29-19)25(34)33(5)6/h8-12,15,27H,7H2,1-6H3,(H3,28,30,31,32)
US Patent
n/an/a<10n/an/an/an/a6.725
Incyte Holdings Corporation; Incyte Corporation
US Patent
Assay Description
Lipid kinase substrate, phosphoinositol-4,5-bisphosphate (PIP2), are purchased from Echelon Biosciences (Salt Lake City, Utah). PI3K isoforms α,...
US Patent US9707233 (2017)
BindingDB Entry DOI: 10.7270/Q2S46V0R
Phosphatidylinositol 4,5-bisphosphate 3-kinase catalytic subunit delta isoform
(Homo sapiens (Human))
BDBM261185
(6-{3-[1-(4-Amino-3-methyl-1H-pyrazolo[3,4-d]pyrimi...)
Show SMILES CCOc1c(cc(Cl)c(C)c1-c1ccc(cn1)C(=O)N(C)C)C(C)Nc1ncnc(N)c1C(C)=N
Show InChI InChI=1S/C25H30ClN7O2/c1-7-35-22-17(15(4)32-24-21(14(3)27)23(28)30-12-31-24)10-18(26)13(2)20(22)19-9-8-16(11-29-19)25(34)33(5)6/h8-12,15,27H,7H2,1-6H3,(H3,28,30,31,32)
NCI pathway
Reactome pathway
US Patent
n/an/a<10n/an/an/an/an/an/a
Istanbul University
Assay Description
The kinase reaction was conducted in polystyrene 384-well matrix white plate from Thermo Fisher Scientific in a final volume of 25 uL. Inhibitors wer...
Bioorg Med Chem 16: 9113-20 (2008)
BindingDB Entry DOI: 10.7270/Q2SJ1NZ2
Phosphatidylinositol 4,5-bisphosphate 3-kinase catalytic subunit delta isoform
(Homo sapiens (Human))
BDBM261185
(6-{3-[1-(4-Amino-3-methyl-1H-pyrazolo[3,4-d]pyrimi...)
Show SMILES CCOc1c(cc(Cl)c(C)c1-c1ccc(cn1)C(=O)N(C)C)C(C)Nc1ncnc(N)c1C(C)=N
Show InChI InChI=1S/C25H30ClN7O2/c1-7-35-22-17(15(4)32-24-21(14(3)27)23(28)30-12-31-24)10-18(26)13(2)20(22)19-9-8-16(11-29-19)25(34)33(5)6/h8-12,15,27H,7H2,1-6H3,(H3,28,30,31,32)
NCI pathway
Reactome pathway
US Patent
n/an/a<10n/an/an/an/an/an/a
Incyte Holdings Corporation; Incyte Corporation
US Patent
Assay Description
[γ-33P]ATP (10 mCi/mL) was purchased from PerkinElmer (Waltham, Mass.). Lipid kinase substrate, D-myo-Phosphatidylinositol 4,5-bisphosphate (Ptd...
US Patent US9730939 (2017)
BindingDB Entry DOI: 10.7270/Q2GB265W
Phosphatidylinositol 4,5-bisphosphate 3-kinase catalytic subunit delta isoform
(Homo sapiens (Human))
BDBM261185
(6-{3-[1-(4-Amino-3-methyl-1H-pyrazolo[3,4-d]pyrimi...)
Show SMILES CCOc1c(cc(Cl)c(C)c1-c1ccc(cn1)C(=O)N(C)C)C(C)Nc1ncnc(N)c1C(C)=N
Show InChI InChI=1S/C25H30ClN7O2/c1-7-35-22-17(15(4)32-24-21(14(3)27)23(28)30-12-31-24)10-18(26)13(2)20(22)19-9-8-16(11-29-19)25(34)33(5)6/h8-12,15,27H,7H2,1-6H3,(H3,28,30,31,32)
NCI pathway
Reactome pathway
US Patent
n/an/a<10n/an/an/an/a6.725
Incyte Holdings Corporation; Incyte Corporation
US Patent
Assay Description
[γ-33P]ATP (10 mCi/mL) was purchased from Perkin-Elmer (Waltham, Mass.). Lipid kinase substrate, D-myo-Phosphatidylinositol 4,5-bisphosphate (Pt...
US Patent US10092570 (2018)
BindingDB Entry DOI: 10.7270/Q2PZ5BW5