BDBM26120 pyrimidine analogue, 8::pyrimidine-4,6-dicarboxylic acid
SMILES: OC(=O)c1cc(ncn1)C(O)=O
InChI Key: InChIKey=XIEOKRXVAACBHI-UHFFFAOYSA-N
Data: 1 IC50
Activity Spreadsheet -- Enzyme Inhibition Constant Data from BindingDB
Found 1 hit for monomerid = 26120
Trg + Lig
Ki
nM
ΔG°
kcal/mole
IC50
nM
Kd
nM
EC50/IC50
nM
koff
s-1
kon
M-1s-1
pHTemp
°C
Histone Lysine Demethylase
(Homo sapiens (Human))
BDBM26120
(pyrimidine analogue, 8 | pyrimidine-4,6-dicarboxyl...)
Show SMILES OC(=O)c1cc(ncn1)C(O)=O
Show InChI InChI=1S/C6H4N2O4/c9-5(10)3-1-4(6(11)12)8-2-7-3/h1-2H,(H,9,10)(H,11,12)
n/an/a 2.70E+4n/an/an/an/a7.537
University of Oxford
Assay Description
A coupled-assay for JMJD2E activity employing formaldehyde dehydrogenase (FDH) from Pseudomonas putida was developed. Formaldehyde release by demethy...
J Med Chem 51: 7053-6 (2008)
Article DOI: 10.1021/jm800936s
BindingDB Entry DOI: 10.7270/Q2959FV4
3D
3D Structure (docked)