BDBM26128 (4-fluorophenyl)boranediol::CHEMBL344890::Phenylboronic Acid, 7
SMILES: OB(O)c1ccc(F)cc1
InChI Key: InChIKey=LBUNNMJLXWQQBY-UHFFFAOYSA-N
Data: 1 KI  2 IC50
PDB links: 1 PDB ID contains this monomer as substructures. 1 PDB ID contains inhibitors having a similarity of 90% to this monomer.
Activity Spreadsheet -- Enzyme Inhibition Constant Data from BindingDB
Found 4 hits for monomerid = 26128
Trg + Lig
Ki
nM
ΔG°
kcal/mole
IC50
nM
Kd
nM
EC50/IC50
nM
koff
s-1
kon
M-1s-1
pHTemp
°C
Beta-lactamase AmpC
(Escherichia coli)
BDBM26128
((4-fluorophenyl)boranediol | CHEMBL344890 | Phenyl...)
Show SMILES OB(O)c1ccc(F)cc1
Show InChI InChI=1S/C6H6BFO2/c8-6-3-1-5(2-4-6)7(9)10/h1-4,9-10H
6.40E+3n/an/an/an/an/an/an/an/a
Northwestern University Medical School
Curated by ChEMBL
Assay Description
Inhibitory activity against E. coli AmpC beta-lactamase.
J Med Chem 41: 4577-86 (1998)
Article DOI: 10.1021/jm980343w
BindingDB Entry DOI: 10.7270/Q22N51FX
Leucyl-tRNA synthetase, cytoplasmic
(Saccharomyces cerevisiae S288c)
BDBM26128
((4-fluorophenyl)boranediol | CHEMBL344890 | Phenyl...)
Show SMILES OB(O)c1ccc(F)cc1
Show InChI InChI=1S/C6H6BFO2/c8-6-3-1-5(2-4-6)7(9)10/h1-4,9-10H
n/an/a>1.00E+5n/an/an/an/an/an/a
Anacor Pharmaceuticals, Inc
Curated by ChEMBL
Assay Description
Inhibition of Saccharomyces cerevisiae cytoplasmic leucyl-tRNA synthetase assessed as tRNA amino-acylation
Science 316: 1759-1761 (2007)
Article DOI: 10.1126/science.1142189
BindingDB Entry DOI: 10.7270/Q2P84CQ2
Fatty-acid amide hydrolase 1 (aa 30-579)
(Rattus norvegicus (rat))
BDBM26128
((4-fluorophenyl)boranediol | CHEMBL344890 | Phenyl...)
Show SMILES OB(O)c1ccc(F)cc1
Show InChI InChI=1S/C6H6BFO2/c8-6-3-1-5(2-4-6)7(9)10/h1-4,9-10H
n/an/a 1.50E+3n/an/an/an/a7.437
University of Oxford
Assay Description
[3H]Ethanolamine produced from [3H]AEA hydrolysis was used to calculate FAAH activity and was measured by scintillation counting of the aqueous phase...
J Med Chem 51: 7057-60 (2008)
Article DOI: 10.1021/jm801051t
BindingDB Entry DOI: 10.7270/Q25D8Q58
Monoglyceride lipase
(Homo sapiens (Human))
BDBM26128
((4-fluorophenyl)boranediol | CHEMBL344890 | Phenyl...)
Show SMILES OB(O)c1ccc(F)cc1
Show InChI InChI=1S/C6H6BFO2/c8-6-3-1-5(2-4-6)7(9)10/h1-4,9-10H
Reactome pathway
n/an/an/an/an/an/an/an/an/a
University of Oxford
Assay Description
The endpoint enzymatic assay was developed to quantify human recombinant MGL activity with 2-AG. The formation of arachidonic acid and depletion of ...
J Med Chem 51: 7057-60 (2008)
Article DOI: 10.1021/jm801051t
BindingDB Entry DOI: 10.7270/Q25D8Q58