BDBM2615 Bisindolylmaleimide deriv. 37::methyl 1-methyl-3-[4-(1-methyl-1H-indol-3-yl)-2,5-dioxo-2,5-dihydro-1H-pyrrol-3-yl]-1H-indole-5-carboxylate
SMILES: COC(=O)c1ccc2n(C)cc(C3=C(C(=O)NC3=O)c3cn(C)c4ccccc34)c2c1
InChI Key: InChIKey=UHNIELRQKFFMTN-UHFFFAOYSA-N
Data: 1 IC50
Activity Spreadsheet -- Enzyme Inhibition Constant Data from BindingDB
Found 1 hit for monomerid = 2615
Trg + Lig
Ki
nM
ΔG°
kcal/mole
IC50
nM
Kd
nM
EC50/IC50
nM
koff
s-1
kon
M-1s-1
pHTemp
°C
Protein Kinase C
(Rattus norvegicus (rat))
BDBM2615
(Bisindolylmaleimide deriv. 37 | methyl 1-methyl-3-...)
Show SMILES COC(=O)c1ccc2n(C)cc(C3=C(C(=O)NC3=O)c3cn(C)c4ccccc34)c2c1 |t:12|
Show InChI InChI=1S/C24H19N3O4/c1-26-11-16(14-6-4-5-7-18(14)26)20-21(23(29)25-22(20)28)17-12-27(2)19-9-8-13(10-15(17)19)24(30)31-3/h4-12H,1-3H3,(H,25,28,29)
n/an/a 1.40E+3n/an/an/an/an/an/a
Roche Products Limited
Assay Description
The activity of PKC, activated by phosphatidylerine and Ca2+, is measured by its ability to transfer phosphate from [gamma-32P]ATP to lysine-rich his...
J Med Chem 35: 177-84 (1992)
Article DOI: 10.1021/jm00079a024
BindingDB Entry DOI: 10.7270/Q2K64G8V