BDBM2622 3-(1-methyl-1H-indol-3-yl)-4-(1-methyl-6-nitro-1H-indol-3-yl)-2,5-dihydro-1H-pyrrole-2,5-dione::Bisindolylmaleimide deriv. 44
SMILES: Cn1cc(C2=C(C(=O)NC2=O)c2cn(C)c3cc(ccc23)[N+]([O-])=O)c2ccccc12
InChI Key: InChIKey=OVSKGTONMLKNPZ-UHFFFAOYSA-N
Data: 1 IC50
Activity Spreadsheet -- Enzyme Inhibition Constant Data from BindingDB
Found 1 hit for monomerid = 2622
Trg + Lig
Ki
nM
ΔG°
kcal/mole
IC50
nM
Kd
nM
EC50/IC50
nM
koff
s-1
kon
M-1s-1
pHTemp
°C
Protein Kinase C
(Rattus norvegicus (rat))
BDBM2622
(3-(1-methyl-1H-indol-3-yl)-4-(1-methyl-6-nitro-1H-...)
Show SMILES Cn1cc(C2=C(C(=O)NC2=O)c2cn(C)c3cc(ccc23)[N+]([O-])=O)c2ccccc12 |t:4|
Show InChI InChI=1S/C22H16N4O4/c1-24-10-15(13-5-3-4-6-17(13)24)19-20(22(28)23-21(19)27)16-11-25(2)18-9-12(26(29)30)7-8-14(16)18/h3-11H,1-2H3,(H,23,27,28)
n/an/a 1.10E+3n/an/an/an/an/an/a
Roche Products Limited
Assay Description
The activity of PKC, activated by phosphatidylerine and Ca2+, is measured by its ability to transfer phosphate from [gamma-32P]ATP to lysine-rich his...
J Med Chem 35: 177-84 (1992)
Article DOI: 10.1021/jm00079a024
BindingDB Entry DOI: 10.7270/Q2K64G8V