BDBM2625 Bisindolylmaleimide deriv. 47::N-{1-methyl-3-[4-(1-methyl-1H-indol-3-yl)-2,5-dioxo-2,5-dihydro-1H-pyrrol-3-yl]-1H-indol-6-yl}acetamide
SMILES: CC(=O)Nc1ccc2c(cn(C)c2c1)C1=C(C(=O)NC1=O)c1cn(C)c2ccccc12
InChI Key: InChIKey=QZTLMPWKXJARBA-UHFFFAOYSA-N
Data: 1 IC50
Activity Spreadsheet -- Enzyme Inhibition Constant Data from BindingDB
Found 1 hit for monomerid = 2625
Trg + Lig
Ki
nM
ΔG°
kcal/mole
IC50
nM
Kd
nM
EC50/IC50
nM
koff
s-1
kon
M-1s-1
pHTemp
°C
Protein kinase C beta type
(Rattus norvegicus (rat))
BDBM2625
(Bisindolylmaleimide deriv. 47 | N-{1-methyl-3-[4-(...)
Show SMILES CC(=O)Nc1ccc2c(cn(C)c2c1)C1=C(C(=O)NC1=O)c1cn(C)c2ccccc12 |t:16|
Show InChI InChI=1S/C24H20N4O3/c1-13(29)25-14-8-9-16-18(12-28(3)20(16)10-14)22-21(23(30)26-24(22)31)17-11-27(2)19-7-5-4-6-15(17)19/h4-12H,1-3H3,(H,25,29)(H,26,30,31)
n/an/a 4.00E+3n/an/an/an/an/an/a
Roche Products Limited
Assay Description
The activity of PKC, activated by phosphatidylerine and Ca2+, is measured by its ability to transfer phosphate from [gamma-32P]ATP to lysine-rich his...
J Med Chem 35: 177-84 (1992)
Article DOI: 10.1021/jm00079a024
BindingDB Entry DOI: 10.7270/Q2K64G8V