BDBM263 (S)-5-({5-[1-Carboxymethyl-2-oxo-3-(pyridin-3-ylmeth-ylsulfanyl)propylcarbamoyl]thiophen-2-ylmethyl}-sulfamoyl)-2-hydroxy-benzoic Acid::5-{[(5-{[(2S)-1-carboxy-3-oxo-4-[(pyridin-3-ylmethyl)sulfanyl]butan-2-yl]carbamoyl}thiophen-2-yl)methyl]sulfamoyl}-2-hydroxybenzoic acid::Inhibitor 71::Thiophene Scaffold 71
SMILES: OC(=O)C[C@H](NC(=O)c1ccc(CNS(=O)(=O)c2ccc(O)c(c2)C(O)=O)s1)C(=O)CSCc1cccnc1
InChI Key: InChIKey=QHKQIPCBIONNNA-SFHVURJKSA-N
Data: 1 KI
Activity Spreadsheet -- Enzyme Inhibition Constant Data from BindingDB
Found 1 hit for monomerid = 263
Trg + Lig
Ki
nM
ΔG°
kcal/mole
IC50
nM
Kd
nM
EC50/IC50
nM
koff
s-1
kon
M-1s-1
pHTemp
°C
Caspase-3
(Homo sapiens (Human))
BDBM263
((S)-5-({5-[1-Carboxymethyl-2-oxo-3-(pyridin-3-ylme...)
Show SMILES OC(=O)C[C@H](NC(=O)c1ccc(CNS(=O)(=O)c2ccc(O)c(c2)C(O)=O)s1)C(=O)CSCc1cccnc1 |r|
Show InChI InChI=1S/C24H23N3O9S3/c28-19-5-4-16(8-17(19)24(33)34)39(35,36)26-11-15-3-6-21(38-15)23(32)27-18(9-22(30)31)20(29)13-37-12-14-2-1-7-25-10-14/h1-8,10,18,26,28H,9,11-13H2,(H,27,32)(H,30,31)(H,33,34)/t18-/m0/s1
NCI pathway
Reactome pathway
20 -10.5n/an/an/an/an/a7.425
Sunesis Pharmaceuticals
Assay Description
The effectiveness of compounds against the activity of human recombinant caspase-1-8 was measured using fluorometric assays. Assays were carried out ...
J Med Chem 45: 5005-22 (2002)
Article DOI: 10.1021/jm020230j
BindingDB Entry DOI: 10.7270/Q2B56GW5