null
SMILES: CC(=O)Nc1cccc2c(cn(C)c12)C1=C(C(=O)NC1=O)c1cn(C)c2ccccc12
InChI Key: InChIKey=RYKJRJBDEVEWLO-UHFFFAOYSA-N
Activity Spreadsheet -- Enzyme Inhibition Constant Data from BindingDB
Found 1 hit for monomerid = 2630
Trg + Lig
Ki
nM
ΔG°
kcal/mole
IC50
nM
Kd
nM
EC50/IC50
nM
koff
s-1
kon
M-1s-1
pHTemp
°C
Protein kinase C beta type
(Rattus norvegicus (rat))
BDBM2630
(3-(7-(Acetylamino)-1-methyl-3-indolyl)-4-(1-methyl...)
Show SMILES CC(=O)Nc1cccc2c(cn(C)c12)C1=C(C(=O)NC1=O)c1cn(C)c2ccccc12 |t:16|
Show InChI InChI=1S/C24H20N4O3/c1-13(29)25-18-9-6-8-15-17(12-28(3)22(15)18)21-20(23(30)26-24(21)31)16-11-27(2)19-10-5-4-7-14(16)19/h4-12H,1-3H3,(H,25,29)(H,26,30,31)
n/an/a 2.40E+3n/an/an/an/an/an/a
Roche Products Limited
Assay Description
The activity of PKC, activated by phosphatidylerine and Ca2+, is measured by its ability to transfer phosphate from [gamma-32P]ATP to lysine-rich his...
J Med Chem 35: 177-84 (1992)
Article DOI: 10.1021/jm00079a024
BindingDB Entry DOI: 10.7270/Q2K64G8V