BDBM26307 4-aminopyrazole quinazoline, 7::N-(3-fluorophenyl)-2-{4-[(7-{3-[(2R)-2-(hydroxymethyl)pyrrolidin-1-yl]propoxy}quinazolin-4-yl)amino]-1H-pyrazol-1-yl}acetamide
SMILES: OC[C@H]1CCCN1CCCOc1ccc2c(Nc3cnn(CC(=O)Nc4cccc(F)c4)c3)ncnc2c1
InChI Key: InChIKey=YWFBQHGACULOLS-JOCHJYFZSA-N
Data: 2 KI
Activity Spreadsheet -- Enzyme Inhibition Constant Data from BindingDB
Found 2 hits for monomerid = 26307
Trg + Lig
Ki
nM
ΔG°
kcal/mole
IC50
nM
Kd
nM
EC50/IC50
nM
koff
s-1
kon
M-1s-1
pHTemp
°C
Aurora kinase B
(Homo sapiens (Human))
BDBM26307
(4-aminopyrazole quinazoline, 7 | N-(3-fluorophenyl...)
Show SMILES OC[C@H]1CCCN1CCCOc1ccc2c(Nc3cnn(CC(=O)Nc4cccc(F)c4)c3)ncnc2c1 |r|
Show InChI InChI=1S/C27H30FN7O3/c28-19-4-1-5-20(12-19)32-26(37)16-35-15-21(14-31-35)33-27-24-8-7-23(13-25(24)29-18-30-27)38-11-3-10-34-9-2-6-22(34)17-36/h1,4-5,7-8,12-15,18,22,36H,2-3,6,9-11,16-17H2,(H,32,37)(H,29,30,33)/t22-/m1/s1
Reactome pathway
<1<-12.1n/an/an/an/an/a7.522
AstraZeneca
Assay Description
In vitro kinase assay using recombinant Aurora B bound to INCENP was incubated at room temperature with substrate, and test compounds in the presence...
Bioorg Med Chem Lett 18: 1904-9 (2008)
Article DOI: 10.1016/j.bmcl.2008.02.002
BindingDB Entry DOI: 10.7270/Q2BZ64C7
Aurora kinase A
(Homo sapiens (Human))
BDBM26307
(4-aminopyrazole quinazoline, 7 | N-(3-fluorophenyl...)
Show SMILES OC[C@H]1CCCN1CCCOc1ccc2c(Nc3cnn(CC(=O)Nc4cccc(F)c4)c3)ncnc2c1 |r|
Show InChI InChI=1S/C27H30FN7O3/c28-19-4-1-5-20(12-19)32-26(37)16-35-15-21(14-31-35)33-27-24-8-7-23(13-25(24)29-18-30-27)38-11-3-10-34-9-2-6-22(34)17-36/h1,4-5,7-8,12-15,18,22,36H,2-3,6,9-11,16-17H2,(H,32,37)(H,29,30,33)/t22-/m1/s1
NCI pathway
Reactome pathway
3.00E+3 -7.45n/an/an/an/an/a7.522
AstraZeneca
Assay Description
In vitro kinase assay using recombinant Aurora A purified from Sf9 cells was incubated at room temperature with substrate, and test compounds in the ...
Bioorg Med Chem Lett 18: 1904-9 (2008)
Article DOI: 10.1016/j.bmcl.2008.02.002
BindingDB Entry DOI: 10.7270/Q2BZ64C7