BDBM26324 1-(3-ethynylphenyl)-3-[5-(2-{thieno[3,2-d]pyrimidin-4-ylamino}ethyl)-1,3-thiazol-2-yl]urea::thieno[3,2-d]pyrimidine analogue, 19
SMILES: O=C(Nc1ncc(CCNc2ncnc3ccsc23)s1)Nc1cccc(c1)C#C
InChI Key: InChIKey=AFEGNUNKORHENU-UHFFFAOYSA-N
Data: 1 IC50
Activity Spreadsheet -- Enzyme Inhibition Constant Data from BindingDB
Found 1 hit for monomerid = 26324
Trg + Lig
Ki
nM
ΔG°
kcal/mole
IC50
nM
Kd
nM
EC50/IC50
nM
koff
s-1
kon
M-1s-1
pHTemp
°C
Aurora Kinase A (Aurora-A)
(Mus musculus (mouse))
BDBM26324
(1-(3-ethynylphenyl)-3-[5-(2-{thieno[3,2-d]pyrimidi...)
Show SMILES O=C(Nc1ncc(CCNc2ncnc3ccsc23)s1)Nc1cccc(c1)C#C
Show InChI InChI=1S/C20H16N6OS2/c1-2-13-4-3-5-14(10-13)25-19(27)26-20-22-11-15(29-20)6-8-21-18-17-16(7-9-28-17)23-12-24-18/h1,3-5,7,9-12H,6,8H2,(H,21,23,24)(H2,22,25,26,27)
Reactome pathway
n/an/a 41n/an/an/an/a7.221
Sunesis Pharmaceuticals
Assay Description
Compounds were diluted into assay buffer containing Aurora kinase and FAM-PKAtide. The kinase reaction was initiated by adding ATP in assay buffer. T...
Bioorg Med Chem Lett 18: 4880-4 (2008)
Article DOI: 10.1016/j.bmcl.2008.07.073
BindingDB Entry DOI: 10.7270/Q279430N