BDBM263527 US9556150, i-15::{5-amino-1-[2-chloro-4-(2- fluoro-phenoxy)-phenyl]-1h- pyrazol-4-yl}-[5-(morpholine- 4-carbonyl)-1h-indol-2-yl]- methanone
SMILES: Nc1c(cnn1-c1ccc(Oc2ccccc2F)cc1Cl)C(=O)c1cc2cc(ccc2[nH]1)C(=O)N1CCOCC1
InChI Key: InChIKey=PFPXJKXLIAEWJP-UHFFFAOYSA-N
Data: 1 IC50
Activity Spreadsheet -- Enzyme Inhibition Constant Data from BindingDB
Found 1 hit for monomerid = 263527
Trg + Lig
Ki
nM
ΔG°
kcal/mole
IC50
nM
Kd
nM
EC50/IC50
nM
koff
s-1
kon
M-1s-1
pHTemp
°C
Tyrosine-protein kinase BTK
(Homo sapiens (Human))
BDBM263527
(US9556150, i-15 | {5-amino-1-[2-chloro-4-(2- fluor...)
Show SMILES Nc1c(cnn1-c1ccc(Oc2ccccc2F)cc1Cl)C(=O)c1cc2cc(ccc2[nH]1)C(=O)N1CCOCC1
Show InChI InChI=1S/C29H23ClFN5O4/c30-21-15-19(40-26-4-2-1-3-22(26)31)6-8-25(21)36-28(32)20(16-33-36)27(37)24-14-18-13-17(5-7-23(18)34-24)29(38)35-9-11-39-12-10-35/h1-8,13-16,34H,9-12,32H2
NCI pathway
Reactome pathway
US Patent
n/an/a 0.820n/an/an/an/a7.15n/a
Hoffmann-La Roche Inc.; Chugai Pharmaceutical Co.
US Patent
Assay Description
This BTK competition assay measures compound potency (IC50) for the inactivated state of Bruton's Tyrosine Kinase using FRET (Förster/Fluorescenc...
US Patent US9556150 (2017)
BindingDB Entry DOI: 10.7270/Q2571F1S