BDBM263562 2-{5-amino-1-[2-chloro-4-(2- dimethylcarbamoyl-phenoxy)- phenyl]-1h-pyrazole-4- carbonyl}-1h-indole-5- carboxylic acid (2- dimethylamino-ethyl)-amide::US9556150, i-50
SMILES: CN(C)C1CCN(C1)C(=O)c1ccc2[nH]c(cc2c1)C(=O)c1cnn(c1N)-c1ccc(Oc2ccccc2C(=O)N(C)C)cc1Cl
InChI Key:
Data: 1 IC50
Activity Spreadsheet -- Enzyme Inhibition Constant Data from BindingDB
Found 1 hit for monomerid = 263562
Trg + Lig
Ki
nM
ΔG°
kcal/mole
IC50
nM
Kd
nM
EC50/IC50
nM
koff
s-1
kon
M-1s-1
pHTemp
°C
Tyrosine-protein kinase BTK
(Homo sapiens (Human))
BDBM263562
(2-{5-amino-1-[2-chloro-4-(2- dimethylcarbamoyl-phe...)
Show SMILES CN(C)C1CCN(C1)C(=O)c1ccc2[nH]c(cc2c1)C(=O)c1cnn(c1N)-c1ccc(Oc2ccccc2C(=O)N(C)C)cc1Cl
NCI pathway
Reactome pathway
US Patent
n/an/a 2.5n/an/an/an/a7.15n/a
Hoffmann-La Roche Inc.; Chugai Pharmaceutical Co.
US Patent
Assay Description
This BTK competition assay measures compound potency (IC50) for the inactivated state of Bruton's Tyrosine Kinase using FRET (Förster/Fluorescenc...
US Patent US9556150 (2017)
BindingDB Entry DOI: 10.7270/Q2571F1S