BDBM26370 3-[3-(2-aminoquinazolin-6-yl)-4-methylphenyl]-1-[3-(trifluoromethyl)phenyl]urea::Aminoquinazoline amide urea, 36
SMILES: Cc1ccc(NC(=O)Nc2cccc(c2)C(F)(F)F)cc1-c1ccc2nc(N)ncc2c1
InChI Key: InChIKey=BIPPSOZOQMDQPZ-UHFFFAOYSA-N
Data: 5 IC50
Activity Spreadsheet -- Enzyme Inhibition Constant Data from BindingDB
Found 5 hits for monomerid = 26370
Trg + Lig
Ki
nM
ΔG°
kcal/mole
IC50
nM
Kd
nM
EC50/IC50
nM
koff
s-1
kon
M-1s-1
pHTemp
°C
Tyrosine-protein kinase Lck
(Homo sapiens (Human))
BDBM26370
(3-[3-(2-aminoquinazolin-6-yl)-4-methylphenyl]-1-[3...)
Show SMILES Cc1ccc(NC(=O)Nc2cccc(c2)C(F)(F)F)cc1-c1ccc2nc(N)ncc2c1
Show InChI InChI=1S/C23H18F3N5O/c1-13-5-7-18(30-22(32)29-17-4-2-3-16(10-17)23(24,25)26)11-19(13)14-6-8-20-15(9-14)12-28-21(27)31-20/h2-12H,1H3,(H2,27,28,31)(H2,29,30,32)
n/an/a 7n/an/an/an/a7.522
Amgen
Assay Description
The assay involves the phosphorylation of a biotinylated substrate and the detection of this phosphorylation after the addition of a streptavidin-all...
J Med Chem 51: 1681-94 (2008)
Article DOI: 10.1021/jm7010996
BindingDB Entry DOI: 10.7270/Q2Q81BCB
Angiopoietin-1 receptor
(Homo sapiens (Human))
BDBM26370
(3-[3-(2-aminoquinazolin-6-yl)-4-methylphenyl]-1-[3...)
Show SMILES Cc1ccc(NC(=O)Nc2cccc(c2)C(F)(F)F)cc1-c1ccc2nc(N)ncc2c1
Show InChI InChI=1S/C23H18F3N5O/c1-13-5-7-18(30-22(32)29-17-4-2-3-16(10-17)23(24,25)26)11-19(13)14-6-8-20-15(9-14)12-28-21(27)31-20/h2-12H,1H3,(H2,27,28,31)(H2,29,30,32)
n/an/a 93n/an/an/an/an/an/a
Amgen
Assay Description
The assay involves the phosphorylation of a biotinylated substrate and the detection of this phosphorylation after the addition of a streptavidin-all...
J Med Chem 51: 1681-94 (2008)
Article DOI: 10.1021/jm7010996
BindingDB Entry DOI: 10.7270/Q2Q81BCB
Tyrosine-protein kinase JAK3
(Homo sapiens (Human))
BDBM26370
(3-[3-(2-aminoquinazolin-6-yl)-4-methylphenyl]-1-[3...)
Show SMILES Cc1ccc(NC(=O)Nc2cccc(c2)C(F)(F)F)cc1-c1ccc2nc(N)ncc2c1
Show InChI InChI=1S/C23H18F3N5O/c1-13-5-7-18(30-22(32)29-17-4-2-3-16(10-17)23(24,25)26)11-19(13)14-6-8-20-15(9-14)12-28-21(27)31-20/h2-12H,1H3,(H2,27,28,31)(H2,29,30,32)
Reactome pathway
n/an/a 3.04E+3n/an/an/an/an/an/a
Amgen
Assay Description
The assay involves the phosphorylation of a biotinylated substrate and the detection of this phosphorylation after the addition of a streptavidin-all...
J Med Chem 51: 1681-94 (2008)
Article DOI: 10.1021/jm7010996
BindingDB Entry DOI: 10.7270/Q2Q81BCB
Mitogen-activated protein kinase 14
(Homo sapiens (Human))
BDBM26370
(3-[3-(2-aminoquinazolin-6-yl)-4-methylphenyl]-1-[3...)
Show SMILES Cc1ccc(NC(=O)Nc2cccc(c2)C(F)(F)F)cc1-c1ccc2nc(N)ncc2c1
Show InChI InChI=1S/C23H18F3N5O/c1-13-5-7-18(30-22(32)29-17-4-2-3-16(10-17)23(24,25)26)11-19(13)14-6-8-20-15(9-14)12-28-21(27)31-20/h2-12H,1H3,(H2,27,28,31)(H2,29,30,32)
NCI pathway
Reactome pathway
n/an/a 28n/an/an/an/an/an/a
Amgen
Assay Description
In vitro kinase assays were done to establish IC50 values against recombinant enzymes using homogeneous time-resolved fluorescence (HTRF) assay. For ...
J Med Chem 51: 1681-94 (2008)
Article DOI: 10.1021/jm7010996
BindingDB Entry DOI: 10.7270/Q2Q81BCB
Vascular endothelial growth factor receptor 2
(Homo sapiens (Human))
BDBM26370
(3-[3-(2-aminoquinazolin-6-yl)-4-methylphenyl]-1-[3...)
Show SMILES Cc1ccc(NC(=O)Nc2cccc(c2)C(F)(F)F)cc1-c1ccc2nc(N)ncc2c1
Show InChI InChI=1S/C23H18F3N5O/c1-13-5-7-18(30-22(32)29-17-4-2-3-16(10-17)23(24,25)26)11-19(13)14-6-8-20-15(9-14)12-28-21(27)31-20/h2-12H,1H3,(H2,27,28,31)(H2,29,30,32)
NCI pathway
Reactome pathway
n/an/a 169n/an/an/an/an/an/a
Amgen
Assay Description
The assay involves the phosphorylation of a biotinylated substrate and the detection of this phosphorylation after the addition of a streptavidin-all...
J Med Chem 51: 1681-94 (2008)
Article DOI: 10.1021/jm7010996
BindingDB Entry DOI: 10.7270/Q2Q81BCB