BDBM264033 2-[5-[[4-fluoro-2-[(4- fluorophenyl)methoxy]phenyl] methoxy]pyrazol-1-yl]pyridine- 4-carboxylic acid::US10173996, Example 118::US9604961, Example 118::US9714230, 118::US9908865, Example 118
SMILES: OC(=O)c1ccnc(c1)-n1nccc1OCc1ccc(F)cc1OCc1ccc(F)cc1
InChI Key: InChIKey=YMWREFXLGWZZOR-UHFFFAOYSA-N
Data: 20 IC50
Activity Spreadsheet -- Enzyme Inhibition Constant Data from BindingDB
Found 20 hits for monomerid = 264033
Trg + Lig
Ki
nM
ΔG°
kcal/mole
IC50
nM
Kd
nM
EC50/IC50
nM
koff
s-1
kon
M-1s-1
pHTemp
°C
Lysine-specific demethylase 5A
(Homo sapiens (Human))
BDBM264033
(2-[5-[[4-fluoro-2-[(4- fluorophenyl)methoxy]phenyl...)
Show SMILES OC(=O)c1ccnc(c1)-n1nccc1OCc1ccc(F)cc1OCc1ccc(F)cc1
Show InChI InChI=1S/C23H17F2N3O4/c24-18-4-1-15(2-5-18)13-31-20-12-19(25)6-3-17(20)14-32-22-8-10-27-28(22)21-11-16(23(29)30)7-9-26-21/h1-12H,13-14H2,(H,29,30)
Reactome pathway
US Patent
n/an/a<100n/an/an/an/an/a25
Celgene Quantical Research, Inc.
US Patent
Assay Description
The enzymatic assay of Jarid1A activity is based upon Time Resolved-Fluorescence Resonance Energy Transfer (TR-FRET) detection. The ability of test c...
US Patent US9714230 (2017)
BindingDB Entry DOI: 10.7270/Q2CR5WC6
Lysine-specific demethylase 2B
(Homo sapiens (Human))
BDBM264033
(2-[5-[[4-fluoro-2-[(4- fluorophenyl)methoxy]phenyl...)
Show SMILES OC(=O)c1ccnc(c1)-n1nccc1OCc1ccc(F)cc1OCc1ccc(F)cc1
Show InChI InChI=1S/C23H17F2N3O4/c24-18-4-1-15(2-5-18)13-31-20-12-19(25)6-3-17(20)14-32-22-8-10-27-28(22)21-11-16(23(29)30)7-9-26-21/h1-12H,13-14H2,(H,29,30)
US Patent
n/an/a 5.50E+3n/an/an/an/an/an/a
The Scripps Research Institute
Assay Description
The ability of test compounds to inhibit the activity of FBXL10 was determined in 384-well plate format under the following reaction conditions: 0.3 ...
J Med Chem 50: 3359-68 (2007)
BindingDB Entry DOI: 10.7270/Q29Z9762
Lysine-specific demethylase 4C
(Homo sapiens (Human))
BDBM264033
(2-[5-[[4-fluoro-2-[(4- fluorophenyl)methoxy]phenyl...)
Show SMILES OC(=O)c1ccnc(c1)-n1nccc1OCc1ccc(F)cc1OCc1ccc(F)cc1
Show InChI InChI=1S/C23H17F2N3O4/c24-18-4-1-15(2-5-18)13-31-20-12-19(25)6-3-17(20)14-32-22-8-10-27-28(22)21-11-16(23(29)30)7-9-26-21/h1-12H,13-14H2,(H,29,30)
US Patent
n/an/a 550n/an/an/an/an/a25
Celgene Quantical Research, Inc.
US Patent
Assay Description
The ability of test compounds to inhibit the activity of JMJD2C was determined in 384-well plate format under the following reaction conditions: 0.3 ...
US Patent US9714230 (2017)
BindingDB Entry DOI: 10.7270/Q2CR5WC6
Lysine-specific demethylase 4A
(Homo sapiens (Human))
BDBM264033
(2-[5-[[4-fluoro-2-[(4- fluorophenyl)methoxy]phenyl...)
Show SMILES OC(=O)c1ccnc(c1)-n1nccc1OCc1ccc(F)cc1OCc1ccc(F)cc1
Show InChI InChI=1S/C23H17F2N3O4/c24-18-4-1-15(2-5-18)13-31-20-12-19(25)6-3-17(20)14-32-22-8-10-27-28(22)21-11-16(23(29)30)7-9-26-21/h1-12H,13-14H2,(H,29,30)
US Patent
n/an/a 550n/an/an/an/an/a25
Celgene Quantical Research, Inc.
US Patent
Assay Description
The ability of test compounds to inhibit the activity of JMJD2A was determined in 384-well plate format under the following reaction conditions: 2 nM...
US Patent US9714230 (2017)
BindingDB Entry DOI: 10.7270/Q2CR5WC6
Lysine-specific demethylase 2B
(Homo sapiens (Human))
BDBM264033
(2-[5-[[4-fluoro-2-[(4- fluorophenyl)methoxy]phenyl...)
Show SMILES OC(=O)c1ccnc(c1)-n1nccc1OCc1ccc(F)cc1OCc1ccc(F)cc1
Show InChI InChI=1S/C23H17F2N3O4/c24-18-4-1-15(2-5-18)13-31-20-12-19(25)6-3-17(20)14-32-22-8-10-27-28(22)21-11-16(23(29)30)7-9-26-21/h1-12H,13-14H2,(H,29,30)
US Patent
n/an/a 5.50E+3n/an/an/an/an/a25
Celgene Quantical Research, Inc.
US Patent
Assay Description
The ability of test compounds to inhibit the activity of FBXL10 was determined in 384-well plate format under the following reaction conditions: 0.3 ...
US Patent US9714230 (2017)
BindingDB Entry DOI: 10.7270/Q2CR5WC6
Lysine-specific demethylase 5A
(Homo sapiens (Human))
BDBM264033
(2-[5-[[4-fluoro-2-[(4- fluorophenyl)methoxy]phenyl...)
Show SMILES OC(=O)c1ccnc(c1)-n1nccc1OCc1ccc(F)cc1OCc1ccc(F)cc1
Show InChI InChI=1S/C23H17F2N3O4/c24-18-4-1-15(2-5-18)13-31-20-12-19(25)6-3-17(20)14-32-22-8-10-27-28(22)21-11-16(23(29)30)7-9-26-21/h1-12H,13-14H2,(H,29,30)
Reactome pathway
US Patent
n/an/a<10n/an/an/an/an/an/a
Celgene Quanticel Research, Inc.
US Patent
Assay Description
The enzymatic assay of Jarid1A activity is based upon Time Resolved-Fluorescence Resonance Energy Transfer (TR-FRET) detection. The ability of test c...
US Patent US9604961 (2017)
BindingDB Entry DOI: 10.7270/Q2KP847M
Lysine-specific demethylase 5B
(Homo sapiens (Human))
BDBM264033
(2-[5-[[4-fluoro-2-[(4- fluorophenyl)methoxy]phenyl...)
Show SMILES OC(=O)c1ccnc(c1)-n1nccc1OCc1ccc(F)cc1OCc1ccc(F)cc1
Show InChI InChI=1S/C23H17F2N3O4/c24-18-4-1-15(2-5-18)13-31-20-12-19(25)6-3-17(20)14-32-22-8-10-27-28(22)21-11-16(23(29)30)7-9-26-21/h1-12H,13-14H2,(H,29,30)
US Patent
n/an/a<10n/an/an/an/an/an/a
Celgene Quanticel Research, Inc.
US Patent
Assay Description
The ability of test compounds to inhibit the activity of Jarid1B was determined in 384-well plate format under the following reaction conditions: 0.8...
US Patent US9604961 (2017)
BindingDB Entry DOI: 10.7270/Q2KP847M
Lysine-specific demethylase 4C
(Homo sapiens (Human))
BDBM264033
(2-[5-[[4-fluoro-2-[(4- fluorophenyl)methoxy]phenyl...)
Show SMILES OC(=O)c1ccnc(c1)-n1nccc1OCc1ccc(F)cc1OCc1ccc(F)cc1
Show InChI InChI=1S/C23H17F2N3O4/c24-18-4-1-15(2-5-18)13-31-20-12-19(25)6-3-17(20)14-32-22-8-10-27-28(22)21-11-16(23(29)30)7-9-26-21/h1-12H,13-14H2,(H,29,30)
US Patent
n/an/a 55n/an/an/an/an/an/a
Celgene Quanticel Research, Inc.
US Patent
Assay Description
The ability of test compounds to inhibit the activity of JMJD2C was determined in 384-well plate format under the following reaction conditions: 0.3 ...
US Patent US9604961 (2017)
BindingDB Entry DOI: 10.7270/Q2KP847M
jmjd2a
(Homo sapiens (Human))
BDBM264033
(2-[5-[[4-fluoro-2-[(4- fluorophenyl)methoxy]phenyl...)
Show SMILES OC(=O)c1ccnc(c1)-n1nccc1OCc1ccc(F)cc1OCc1ccc(F)cc1
Show InChI InChI=1S/C23H17F2N3O4/c24-18-4-1-15(2-5-18)13-31-20-12-19(25)6-3-17(20)14-32-22-8-10-27-28(22)21-11-16(23(29)30)7-9-26-21/h1-12H,13-14H2,(H,29,30)
US Patent
n/an/a 55n/an/an/an/an/an/a
Celgene Quanticel Research, Inc.
US Patent
Assay Description
The ability of test compounds to inhibit the activity of JMJD2A was determined in 384-well plate format under the following reaction conditions: 2 nM...
US Patent US9604961 (2017)
BindingDB Entry DOI: 10.7270/Q2KP847M
Lysine-specific demethylase 2B
(Homo sapiens (Human))
BDBM264033
(2-[5-[[4-fluoro-2-[(4- fluorophenyl)methoxy]phenyl...)
Show SMILES OC(=O)c1ccnc(c1)-n1nccc1OCc1ccc(F)cc1OCc1ccc(F)cc1
Show InChI InChI=1S/C23H17F2N3O4/c24-18-4-1-15(2-5-18)13-31-20-12-19(25)6-3-17(20)14-32-22-8-10-27-28(22)21-11-16(23(29)30)7-9-26-21/h1-12H,13-14H2,(H,29,30)
US Patent
n/an/a 5.50E+3n/an/an/an/an/an/a
Celgene Quanticel Research, Inc.
US Patent
Assay Description
The ability of test compounds to inhibit the activity of FBXL10 was determined in 384-well plate format under the following reaction conditions: 0.3 ...
US Patent US9604961 (2017)
BindingDB Entry DOI: 10.7270/Q2KP847M
Lysine-specific demethylase 5A
(Homo sapiens (Human))
BDBM264033
(2-[5-[[4-fluoro-2-[(4- fluorophenyl)methoxy]phenyl...)
Show SMILES OC(=O)c1ccnc(c1)-n1nccc1OCc1ccc(F)cc1OCc1ccc(F)cc1
Show InChI InChI=1S/C23H17F2N3O4/c24-18-4-1-15(2-5-18)13-31-20-12-19(25)6-3-17(20)14-32-22-8-10-27-28(22)21-11-16(23(29)30)7-9-26-21/h1-12H,13-14H2,(H,29,30)
Reactome pathway
US Patent
n/an/a<100n/an/an/an/an/an/a
Celgene Quanticel Research, Inc.
US Patent
Assay Description
The enzymatic assay of Jarid1A activity is based upon Time Resolved-Fluorescence Resonance Energy Transfer (TR-FRET) detection. The ability of test c...
US Patent US10173996 (2019)
BindingDB Entry DOI: 10.7270/Q2CJ8GK0
Lysine-specific demethylase 5B
(Homo sapiens (Human))
BDBM264033
(2-[5-[[4-fluoro-2-[(4- fluorophenyl)methoxy]phenyl...)
Show SMILES OC(=O)c1ccnc(c1)-n1nccc1OCc1ccc(F)cc1OCc1ccc(F)cc1
Show InChI InChI=1S/C23H17F2N3O4/c24-18-4-1-15(2-5-18)13-31-20-12-19(25)6-3-17(20)14-32-22-8-10-27-28(22)21-11-16(23(29)30)7-9-26-21/h1-12H,13-14H2,(H,29,30)
US Patent
n/an/a<100n/an/an/an/an/an/a
Celgene Quanticel Research, Inc.
US Patent
Assay Description
The ability of test compounds to inhibit the activity of Jarid1B was determined in 384-well plate format under the following reaction conditions: 0.8...
US Patent US10173996 (2019)
BindingDB Entry DOI: 10.7270/Q2CJ8GK0
Lysine-specific demethylase 4C
(Homo sapiens (Human))
BDBM264033
(2-[5-[[4-fluoro-2-[(4- fluorophenyl)methoxy]phenyl...)
Show SMILES OC(=O)c1ccnc(c1)-n1nccc1OCc1ccc(F)cc1OCc1ccc(F)cc1
Show InChI InChI=1S/C23H17F2N3O4/c24-18-4-1-15(2-5-18)13-31-20-12-19(25)6-3-17(20)14-32-22-8-10-27-28(22)21-11-16(23(29)30)7-9-26-21/h1-12H,13-14H2,(H,29,30)
US Patent
n/an/a 550n/an/an/an/an/an/a
Celgene Quanticel Research, Inc.
US Patent
Assay Description
The ability of test compounds to inhibit the activity of JMJD2C was determined in 384-well plate format under the following reaction conditions: 0.3 ...
US Patent US10173996 (2019)
BindingDB Entry DOI: 10.7270/Q2CJ8GK0
Lysine-specific demethylase 4A
(Homo sapiens (Human))
BDBM264033
(2-[5-[[4-fluoro-2-[(4- fluorophenyl)methoxy]phenyl...)
Show SMILES OC(=O)c1ccnc(c1)-n1nccc1OCc1ccc(F)cc1OCc1ccc(F)cc1
Show InChI InChI=1S/C23H17F2N3O4/c24-18-4-1-15(2-5-18)13-31-20-12-19(25)6-3-17(20)14-32-22-8-10-27-28(22)21-11-16(23(29)30)7-9-26-21/h1-12H,13-14H2,(H,29,30)
US Patent
n/an/a 550n/an/an/an/an/an/a
Celgene Quanticel Research, Inc.
US Patent
Assay Description
The ability of test compounds to inhibit the activity of JMJD2A was determined in 384-well plate format under the following reaction conditions: 2 nM...
US Patent US10173996 (2019)
BindingDB Entry DOI: 10.7270/Q2CJ8GK0
Lysine-specific demethylase 2B
(Homo sapiens (Human))
BDBM264033
(2-[5-[[4-fluoro-2-[(4- fluorophenyl)methoxy]phenyl...)
Show SMILES OC(=O)c1ccnc(c1)-n1nccc1OCc1ccc(F)cc1OCc1ccc(F)cc1
Show InChI InChI=1S/C23H17F2N3O4/c24-18-4-1-15(2-5-18)13-31-20-12-19(25)6-3-17(20)14-32-22-8-10-27-28(22)21-11-16(23(29)30)7-9-26-21/h1-12H,13-14H2,(H,29,30)
US Patent
n/an/a 5.50E+3n/an/an/an/an/an/a
Celgene Quanticel Research, Inc.
US Patent
Assay Description
The ability of test compounds to inhibit the activity of FBXL10 was determined in 384-well plate format under the following reaction conditions: 0.3 ...
US Patent US10173996 (2019)
BindingDB Entry DOI: 10.7270/Q2CJ8GK0
Lysine-specific demethylase 5A
(Homo sapiens (Human))
BDBM264033
(2-[5-[[4-fluoro-2-[(4- fluorophenyl)methoxy]phenyl...)
Show SMILES OC(=O)c1ccnc(c1)-n1nccc1OCc1ccc(F)cc1OCc1ccc(F)cc1
Show InChI InChI=1S/C23H17F2N3O4/c24-18-4-1-15(2-5-18)13-31-20-12-19(25)6-3-17(20)14-32-22-8-10-27-28(22)21-11-16(23(29)30)7-9-26-21/h1-12H,13-14H2,(H,29,30)
Reactome pathway
US Patent
n/an/a<100n/an/an/an/an/an/a
The Scripps Research Institute
Assay Description
The enzymatic assay of Jarid1A activity is based upon Time Resolved-Fluorescence Resonance Energy Transfer (TR-FRET) detection. The ability of test c...
J Med Chem 50: 3359-68 (2007)
BindingDB Entry DOI: 10.7270/Q29Z9762
Lysine-specific demethylase 5B
(Homo sapiens (Human))
BDBM264033
(2-[5-[[4-fluoro-2-[(4- fluorophenyl)methoxy]phenyl...)
Show SMILES OC(=O)c1ccnc(c1)-n1nccc1OCc1ccc(F)cc1OCc1ccc(F)cc1
Show InChI InChI=1S/C23H17F2N3O4/c24-18-4-1-15(2-5-18)13-31-20-12-19(25)6-3-17(20)14-32-22-8-10-27-28(22)21-11-16(23(29)30)7-9-26-21/h1-12H,13-14H2,(H,29,30)
US Patent
n/an/a<100n/an/an/an/an/an/a
The Scripps Research Institute
Assay Description
The ability of test compounds to inhibit the activity of Jarid1B was determined in 384-well plate format under the following reaction conditions: 0.8...
J Med Chem 50: 3359-68 (2007)
BindingDB Entry DOI: 10.7270/Q29Z9762
Lysine-specific demethylase 4C
(Homo sapiens (Human))
BDBM264033
(2-[5-[[4-fluoro-2-[(4- fluorophenyl)methoxy]phenyl...)
Show SMILES OC(=O)c1ccnc(c1)-n1nccc1OCc1ccc(F)cc1OCc1ccc(F)cc1
Show InChI InChI=1S/C23H17F2N3O4/c24-18-4-1-15(2-5-18)13-31-20-12-19(25)6-3-17(20)14-32-22-8-10-27-28(22)21-11-16(23(29)30)7-9-26-21/h1-12H,13-14H2,(H,29,30)
US Patent
n/an/a 550n/an/an/an/an/an/a
The Scripps Research Institute
Assay Description
The ability of test compounds to inhibit the activity of JMJD2C was determined in 384-well plate format under the following reaction conditions: 0.3 ...
J Med Chem 50: 3359-68 (2007)
BindingDB Entry DOI: 10.7270/Q29Z9762
Lysine-specific demethylase 4A
(Homo sapiens (Human))
BDBM264033
(2-[5-[[4-fluoro-2-[(4- fluorophenyl)methoxy]phenyl...)
Show SMILES OC(=O)c1ccnc(c1)-n1nccc1OCc1ccc(F)cc1OCc1ccc(F)cc1
Show InChI InChI=1S/C23H17F2N3O4/c24-18-4-1-15(2-5-18)13-31-20-12-19(25)6-3-17(20)14-32-22-8-10-27-28(22)21-11-16(23(29)30)7-9-26-21/h1-12H,13-14H2,(H,29,30)
US Patent
n/an/a 550n/an/an/an/an/an/a
The Scripps Research Institute
Assay Description
The ability of test compounds to inhibit the activity of JMJD2A was determined in 38-well plate format under the following reaction conditions: 2 nM ...
J Med Chem 50: 3359-68 (2007)
BindingDB Entry DOI: 10.7270/Q29Z9762
Lysine-specific demethylase 5B
(Homo sapiens (Human))
BDBM264033
(2-[5-[[4-fluoro-2-[(4- fluorophenyl)methoxy]phenyl...)
Show SMILES OC(=O)c1ccnc(c1)-n1nccc1OCc1ccc(F)cc1OCc1ccc(F)cc1
Show InChI InChI=1S/C23H17F2N3O4/c24-18-4-1-15(2-5-18)13-31-20-12-19(25)6-3-17(20)14-32-22-8-10-27-28(22)21-11-16(23(29)30)7-9-26-21/h1-12H,13-14H2,(H,29,30)
US Patent
n/an/a<100n/an/an/an/an/a25
Celgene Quantical Research, Inc.
US Patent
Assay Description
The ability of test compounds to inhibit the activity of Jarid1B was determined in 384-well plate format under the following reaction conditions: 0.8...
US Patent US9714230 (2017)
BindingDB Entry DOI: 10.7270/Q2CR5WC6