BDBM26567 (3R,4R)-3-N-hydroxy-4-N-(4-{[2-(propan-2-yl)-1-benzofuran-3-yl]methyl}benzene)oxane-3,4-dicarboxamide::2-isopropylbenzofuran, 28
SMILES: CC(C)c1oc2ccccc2c1Cc1ccc(cc1)C(=O)N[C@@H]1CCOC[C@@H]1C(=O)NO
InChI Key: InChIKey=JRZMGNCXDSZZAF-LEWJYISDSA-N
Data: 4 KI  1 IC50
Activity Spreadsheet -- Enzyme Inhibition Constant Data from BindingDB
Found 5 hits for monomerid = 26567
Trg + Lig
Ki
nM
ΔG°
kcal/mole
IC50
nM
Kd
nM
EC50/IC50
nM
koff
s-1
kon
M-1s-1
pHTemp
°C
Matrix metalloproteinase-12 (MMP12)
(Homo sapiens (Human))
BDBM26567
((3R,4R)-3-N-hydroxy-4-N-(4-{[2-(propan-2-yl)-1-ben...)
Show SMILES CC(C)c1oc2ccccc2c1Cc1ccc(cc1)C(=O)N[C@@H]1CCOC[C@@H]1C(=O)NO |r|
Show InChI InChI=1S/C25H28N2O5/c1-15(2)23-19(18-5-3-4-6-22(18)32-23)13-16-7-9-17(10-8-16)24(28)26-21-11-12-31-14-20(21)25(29)27-30/h3-10,15,20-21,30H,11-14H2,1-2H3,(H,26,28)(H,27,29)/t20-,21+/m0/s1
Reactome pathway
10n/an/an/an/an/an/an/an/a
Bristol-Myers Squibb Company
Assay Description
The compounds were tested for enzyme inhibition using fluorescence resonance energy transfer (FRET) assay. Fluorescence measurements were performed i...
Bioorg Med Chem Lett 18: 1958-62 (2008)
Article DOI: 10.1016/j.bmcl.2008.01.120
BindingDB Entry DOI: 10.7270/Q25B00SX
Stromelysin-1
(Homo sapiens (Human))
BDBM26567
((3R,4R)-3-N-hydroxy-4-N-(4-{[2-(propan-2-yl)-1-ben...)
Show SMILES CC(C)c1oc2ccccc2c1Cc1ccc(cc1)C(=O)N[C@@H]1CCOC[C@@H]1C(=O)NO |r|
Show InChI InChI=1S/C25H28N2O5/c1-15(2)23-19(18-5-3-4-6-22(18)32-23)13-16-7-9-17(10-8-16)24(28)26-21-11-12-31-14-20(21)25(29)27-30/h3-10,15,20-21,30H,11-14H2,1-2H3,(H,26,28)(H,27,29)/t20-,21+/m0/s1
Reactome pathway
766n/an/an/an/an/an/an/an/a
Bristol-Myers Squibb Company
Assay Description
The compounds were tested for enzyme inhibition using fluorescence resonance energy transfer (FRET) assay. Fluorescence measurements were performed i...
Bioorg Med Chem Lett 18: 1958-62 (2008)
Article DOI: 10.1016/j.bmcl.2008.01.120
BindingDB Entry DOI: 10.7270/Q25B00SX
Matrix metalloproteinase-7 (MMP7)
(Homo sapiens (Human))
BDBM26567
((3R,4R)-3-N-hydroxy-4-N-(4-{[2-(propan-2-yl)-1-ben...)
Show SMILES CC(C)c1oc2ccccc2c1Cc1ccc(cc1)C(=O)N[C@@H]1CCOC[C@@H]1C(=O)NO |r|
Show InChI InChI=1S/C25H28N2O5/c1-15(2)23-19(18-5-3-4-6-22(18)32-23)13-16-7-9-17(10-8-16)24(28)26-21-11-12-31-14-20(21)25(29)27-30/h3-10,15,20-21,30H,11-14H2,1-2H3,(H,26,28)(H,27,29)/t20-,21+/m0/s1
Reactome pathway
811n/an/an/an/an/an/an/an/a
Bristol-Myers Squibb Company
Assay Description
The compounds were tested for enzyme inhibition using fluorescence resonance energy transfer (FRET) assay. Fluorescence measurements were performed i...
Bioorg Med Chem Lett 18: 1958-62 (2008)
Article DOI: 10.1016/j.bmcl.2008.01.120
BindingDB Entry DOI: 10.7270/Q25B00SX
72 kDa type IV collagenase
(Homo sapiens (Human))
BDBM26567
((3R,4R)-3-N-hydroxy-4-N-(4-{[2-(propan-2-yl)-1-ben...)
Show SMILES CC(C)c1oc2ccccc2c1Cc1ccc(cc1)C(=O)N[C@@H]1CCOC[C@@H]1C(=O)NO |r|
Show InChI InChI=1S/C25H28N2O5/c1-15(2)23-19(18-5-3-4-6-22(18)32-23)13-16-7-9-17(10-8-16)24(28)26-21-11-12-31-14-20(21)25(29)27-30/h3-10,15,20-21,30H,11-14H2,1-2H3,(H,26,28)(H,27,29)/t20-,21+/m0/s1
Reactome pathway
>3.33E+3>-7.47n/an/an/an/an/a7.525
Bristol-Myers Squibb Company
Assay Description
The compounds were tested for enzyme inhibition using fluorescence resonance energy transfer (FRET) assay. Fluorescence measurements were performed i...
Bioorg Med Chem Lett 18: 1958-62 (2008)
Article DOI: 10.1016/j.bmcl.2008.01.120
BindingDB Entry DOI: 10.7270/Q25B00SX
ADAM17
(Sus scrofa (pig))
BDBM26567
((3R,4R)-3-N-hydroxy-4-N-(4-{[2-(propan-2-yl)-1-ben...)
Show SMILES CC(C)c1oc2ccccc2c1Cc1ccc(cc1)C(=O)N[C@@H]1CCOC[C@@H]1C(=O)NO |r|
Show InChI InChI=1S/C25H28N2O5/c1-15(2)23-19(18-5-3-4-6-22(18)32-23)13-16-7-9-17(10-8-16)24(28)26-21-11-12-31-14-20(21)25(29)27-30/h3-10,15,20-21,30H,11-14H2,1-2H3,(H,26,28)(H,27,29)/t20-,21+/m0/s1
n/an/a 2.10n/an/an/an/a7.525
Bristol-Myers Squibb Company
Assay Description
The compounds were tested for enzyme inhibition using fluorescence resonance energy transfer (FRET) assay. Fluorescence measurements were performed i...
Bioorg Med Chem Lett 18: 1958-62 (2008)
Article DOI: 10.1016/j.bmcl.2008.01.120
BindingDB Entry DOI: 10.7270/Q25B00SX