BDBM26598 3-[1-(carboxymethyl)-5-(4-fluorophenyl)-1H-pyrrol-2-yl]propanoic acid::cid_650632::propanoic acid analogue, 23
SMILES: OC(=O)CCc1ccc(-c2ccc(F)cc2)n1CC(O)=O
InChI Key: InChIKey=HSGWFJNNFBQUEX-UHFFFAOYSA-N
Data: 3 IC50
Activity Spreadsheet -- Enzyme Inhibition Constant Data from BindingDB
Found 3 hits for monomerid = 26598
Trg + Lig
Ki
nM
ΔG°
kcal/mole
IC50
nM
Kd
nM
EC50/IC50
nM
koff
s-1
kon
M-1s-1
pHTemp
°C
Apurinic-apyrimidinic endonuclease 1 (APE-1)
(Homo sapiens (Human))
BDBM26598
(3-[1-(carboxymethyl)-5-(4-fluorophenyl)-1H-pyrrol-...)
Show SMILES OC(=O)CCc1ccc(-c2ccc(F)cc2)n1CC(O)=O
Show InChI InChI=1S/C15H14FNO4/c16-11-3-1-10(2-4-11)13-7-5-12(6-8-14(18)19)17(13)9-15(20)21/h1-5,7H,6,8-9H2,(H,18,19)(H,20,21)
Reactome pathway
n/an/a 9.00E+3n/an/an/an/a7.530
University of Southern California
Assay Description
To determine the extent of abasic residue cleavage by APE1, recombinant APE1 was preincubated with the potential inhibitors in reaction buffer. Then,...
J Med Chem 52: 20-32 (2009)
Article DOI: 10.1021/jm800739m
BindingDB Entry DOI: 10.7270/Q21J9822
Procathepsin L
(Homo sapiens (Human))
BDBM26598
(3-[1-(carboxymethyl)-5-(4-fluorophenyl)-1H-pyrrol-...)
Show SMILES OC(=O)CCc1ccc(-c2ccc(F)cc2)n1CC(O)=O
Show InChI InChI=1S/C15H14FNO4/c16-11-3-1-10(2-4-11)13-7-5-12(6-8-14(18)19)17(13)9-15(20)21/h1-5,7H,6,8-9H2,(H,18,19)(H,20,21)
Reactome pathway
PCBioAssay
n/an/a>5.00E+4n/an/an/an/an/an/a
PCMD
Curated by PubChem BioAssay
Assay Description
Screening Center: Penn Center for Molecular Discovery Center Affiliation: University of Pennsylvania Network: Molecular Library Screening Center Netw...
PubChem Bioassay (2009)
BindingDB Entry DOI: 10.7270/Q2WH2NDV
Cathepsin S
(Homo sapiens (Human))
BDBM26598
(3-[1-(carboxymethyl)-5-(4-fluorophenyl)-1H-pyrrol-...)
Show SMILES OC(=O)CCc1ccc(-c2ccc(F)cc2)n1CC(O)=O
Show InChI InChI=1S/C15H14FNO4/c16-11-3-1-10(2-4-11)13-7-5-12(6-8-14(18)19)17(13)9-15(20)21/h1-5,7H,6,8-9H2,(H,18,19)(H,20,21)
Reactome pathway
PCBioAssay
n/an/a>5.00E+4n/an/an/an/an/an/a
PCMD
Curated by PubChem BioAssay
Assay Description
Screening Center: Penn Center for Molecular Discovery Center Affiliation: University of Pennsylvania Network: Molecular Library Screening Center Netw...
PubChem Bioassay (2008)
BindingDB Entry DOI: 10.7270/Q2V69H02