BDBM266437 US9718790, I-1506
SMILES: CCOC(=O)CCn1c(=O)[nH]\c(=N/c2ccc3nc(CC)sc3c2)n(Cc2ccc(C)cc2)c1=O
InChI Key: InChIKey=CEQCXOBVKBJSKA-UHFFFAOYSA-N
Data: 1 IC50
Activity Spreadsheet -- Enzyme Inhibition Constant Data from BindingDB
Found 1 hit for monomerid = 266437
Trg + Lig
Ki
nM
ΔG°
kcal/mole
IC50
nM
Kd
nM
EC50/IC50
nM
koff
s-1
kon
M-1s-1
pHTemp
°C
P2X purinoceptor 3
(Homo sapiens (Human))
BDBM266437
(US9718790, I-1506)
Show SMILES CCOC(=O)CCn1c(=O)[nH]\c(=N/c2ccc3nc(CC)sc3c2)n(Cc2ccc(C)cc2)c1=O
Show InChI InChI=1S/C25H27N5O4S/c1-4-21-27-19-11-10-18(14-20(19)35-21)26-23-28-24(32)29(13-12-22(31)34-5-2)25(33)30(23)15-17-8-6-16(3)7-9-17/h6-11,14H,4-5,12-13,15H2,1-3H3,(H,26,28,32)
US Patent
n/an/a 2n/an/an/an/a7.5n/a
SHIONOGI & CO., LTD.
US Patent
Assay Description
Stably expressing cell line (C6BU-1 transfected with human P2X3 receptor gene (GenBank accession number Y07683) was used. The cells were seeded in a ...
US Patent US9718790 (2017)
BindingDB Entry DOI: 10.7270/Q22809KB