null
SMILES: CCn1c(=O)[nH]\c(=N/c2ccc(Oc3ccnc(NC(=O)NC)c3)cc2)n(Cc2ccc(Cl)cc2)c1=O
InChI Key: InChIKey=JTVPHPNFXJYUGE-UHFFFAOYSA-N
Activity Spreadsheet -- Enzyme Inhibition Constant Data from BindingDB
Found 1 hit for monomerid = 266691
Trg + Lig
Ki
nM
ΔG°
kcal/mole
IC50
nM
Kd
nM
EC50/IC50
nM
koff
s-1
kon
M-1s-1
pHTemp
°C
P2X purinoceptor 3
(Homo sapiens (Human))
BDBM266691
(US9718790, I-2425)
Show SMILES CCn1c(=O)[nH]\c(=N/c2ccc(Oc3ccnc(NC(=O)NC)c3)cc2)n(Cc2ccc(Cl)cc2)c1=O
Show InChI InChI=1S/C25H24ClN7O4/c1-3-32-24(35)31-22(33(25(32)36)15-16-4-6-17(26)7-5-16)29-18-8-10-19(11-9-18)37-20-12-13-28-21(14-20)30-23(34)27-2/h4-14H,3,15H2,1-2H3,(H,29,31,35)(H2,27,28,30,34)
US Patent
n/an/a 2n/an/an/an/a7.5n/a
SHIONOGI & CO., LTD.
US Patent
Assay Description
Stably expressing cell line (C6BU-1 transfected with human P2X3 receptor gene (GenBank accession number Y07683) was used. The cells were seeded in a ...
US Patent US9718790 (2017)
BindingDB Entry DOI: 10.7270/Q22809KB