null
SMILES: Cc1nsc(Oc2ccc(cc2F)\N=c2/[nH]c(=O)n(C[C@H](O)CO)c(=O)n2Cc2ccc(Cl)cc2)n1
InChI Key:
Activity Spreadsheet -- Enzyme Inhibition Constant Data from BindingDB
Found 1 hit for monomerid = 266961
Trg + Lig
Ki
nM
ΔG°
kcal/mole
IC50
nM
Kd
nM
EC50/IC50
nM
koff
s-1
kon
M-1s-1
pHTemp
°C
P2X purinoceptor 3
(Homo sapiens (Human))
BDBM266961
(US9718790, I-2708)
Show SMILES Cc1nsc(Oc2ccc(cc2F)\N=c2/[nH]c(=O)n(C[C@H](O)CO)c(=O)n2Cc2ccc(Cl)cc2)n1 |r|
US Patent
n/an/a 2n/an/an/an/a7.5n/a
SHIONOGI & CO., LTD.
US Patent
Assay Description
Stably expressing cell line (C6BU-1 transfected with human P2X3 receptor gene (GenBank accession number Y07683) was used. The cells were seeded in a ...
US Patent US9718790 (2017)
BindingDB Entry DOI: 10.7270/Q22809KB