BDBM26699 9-butyl-7-chloro-6-fluoro-1H,3H,4H,9H-quinolino[2,3-c][1,2]oxazole-3,4-dione::Isoxazoloquinolinedione, 7
SMILES: CCCCn1c2noc(=O)c2c(O)c2cc(F)c(Cl)cc12
InChI Key: InChIKey=UWQLIXURTCXRJT-UHFFFAOYSA-N
Data: 2 KI
Activity Spreadsheet -- Enzyme Inhibition Constant Data from BindingDB
Found 2 hits for monomerid = 26699
Trg + Lig
Ki
nM
ΔG°
kcal/mole
IC50
nM
Kd
nM
EC50/IC50
nM
koff
s-1
kon
M-1s-1
pHTemp
°C
Serine/threonine-protein kinase pim-1
(Homo sapiens (Human))
BDBM26699
(9-butyl-7-chloro-6-fluoro-1H,3H,4H,9H-quinolino[2,...)
Show SMILES CCCCn1c2noc(=O)c2c(O)c2cc(F)c(Cl)cc12
Show InChI InChI=1S/C14H12ClFN2O3/c1-2-3-4-18-10-6-8(15)9(16)5-7(10)12(19)11-13(18)17-21-14(11)20/h5-6,19H,2-4H2,1H3
15 -10.6n/an/an/an/an/a7.522
Abbott Laboratories
Assay Description
Assays were conducted in 384-well v-bottom polypropylene plates. Test compound was mixed with Pim and biotinylated peptide substrate, followed by imm...
Bioorg Med Chem Lett 18: 5206-8 (2008)
Article DOI: 10.1016/j.bmcl.2008.08.079
BindingDB Entry DOI: 10.7270/Q2833QBF
Serine/threonine-protein kinase pim-2
(Homo sapiens (Human))
BDBM26699
(9-butyl-7-chloro-6-fluoro-1H,3H,4H,9H-quinolino[2,...)
Show SMILES CCCCn1c2noc(=O)c2c(O)c2cc(F)c(Cl)cc12
Show InChI InChI=1S/C14H12ClFN2O3/c1-2-3-4-18-10-6-8(15)9(16)5-7(10)12(19)11-13(18)17-21-14(11)20/h5-6,19H,2-4H2,1H3
165 -9.15n/an/an/an/an/a7.522
Abbott Laboratories
Assay Description
Assays were conducted in 384-well v-bottom polypropylene plates. Test compound was mixed with Pim and biotinylated peptide substrate, followed by imm...
Bioorg Med Chem Lett 18: 5206-8 (2008)
Article DOI: 10.1016/j.bmcl.2008.08.079
BindingDB Entry DOI: 10.7270/Q2833QBF