BDBM267026 Methyl 4-({[5-(2,5-difluorophenyl)thiophen-2-yl]sulfonyl}amino)-2-hydroxybenzoate::US9718809, 118
SMILES: COC(=O)c1ccc(NS(=O)(=O)c2ccc(s2)-c2cc(F)ccc2F)cc1O
InChI Key: InChIKey=XPYNZNAINPLVLP-UHFFFAOYSA-N
Data: 1 IC50
Activity Spreadsheet -- Enzyme Inhibition Constant Data from BindingDB
Found 1 hit for monomerid = 267026
Trg + Lig
Ki
nM
ΔG°
kcal/mole
IC50
nM
Kd
nM
EC50/IC50
nM
koff
s-1
kon
M-1s-1
pHTemp
°C
6-phosphofructo-2-kinase/fructose-2,6-bisphosphatase 4
(Homo sapiens (Human))
BDBM267026
(Methyl 4-({[5-(2,5-difluorophenyl)thiophen-2-yl]su...)
Show SMILES COC(=O)c1ccc(NS(=O)(=O)c2ccc(s2)-c2cc(F)ccc2F)cc1O
Show InChI InChI=1S/C18H13F2NO5S2/c1-26-18(23)12-4-3-11(9-15(12)22)21-28(24,25)17-7-6-16(27-17)13-8-10(19)2-5-14(13)20/h2-9,21-22H,1H3
US Patent
n/an/a 2.00E+3n/an/an/an/an/an/a
Kancera AB
US Patent
Assay Description
6-phosphofructo-2-kinase/fructose-2,6-bisphosphatase (PFK-2/BPase-2) is a bi-functional enzyme that catalyses the formation and degradation of fructo...
US Patent US9718809 (2017)
BindingDB Entry DOI: 10.7270/Q28S4RXR