null
SMILES: COC(=O)c1ccc(NS(=O)(=O)c2cc(c(Cl)s2)-c2cc(F)ccc2O)cc1O
InChI Key: InChIKey=HGDPSZOCCFZUFQ-UHFFFAOYSA-N
Activity Spreadsheet -- Enzyme Inhibition Constant Data from BindingDB
Found 1 hit for monomerid = 267049
Trg + Lig
Ki
nM
ΔG°
kcal/mole
IC50
nM
Kd
nM
EC50/IC50
nM
koff
s-1
kon
M-1s-1
pHTemp
°C
6-phosphofructo-2-kinase/fructose-2,6-bisphosphatase 4
(Homo sapiens (Human))
BDBM267049
(Methyl 4-({[5-chloro-4-(5-fluoro-2-hydroxyphenyl)-...)
Show SMILES COC(=O)c1ccc(NS(=O)(=O)c2cc(c(Cl)s2)-c2cc(F)ccc2O)cc1O
Show InChI InChI=1S/C18H13ClFNO6S2/c1-27-18(24)11-4-3-10(7-15(11)23)21-29(25,26)16-8-13(17(19)28-16)12-6-9(20)2-5-14(12)22/h2-8,21-23H,1H3
US Patent
n/an/a 2.00E+3n/an/an/an/an/an/a
Kancera AB
US Patent
Assay Description
6-phosphofructo-2-kinase/fructose-2,6-bisphosphatase (PFK-2/BPase-2) is a bi-functional enzyme that catalyses the formation and degradation of fructo...
US Patent US9718809 (2017)
BindingDB Entry DOI: 10.7270/Q28S4RXR