BDBM26706 7-chloro-9-ethyl-6-methoxy-1H,3H,4H,9H-quinolino[2,3-c][1,2]oxazole-3,4-dione::Isoxazoloquinolinedione, 18
SMILES: CCn1c2noc(=O)c2c(O)c2cc(OC)c(Cl)cc12
InChI Key: InChIKey=DTZYTUDBCJYVKR-UHFFFAOYSA-N
Data: 2 KI
Activity Spreadsheet -- Enzyme Inhibition Constant Data from BindingDB
Found 2 hits for monomerid = 26706
Trg + Lig
Ki
nM
ΔG°
kcal/mole
IC50
nM
Kd
nM
EC50/IC50
nM
koff
s-1
kon
M-1s-1
pHTemp
°C
Serine/threonine-protein kinase pim-2
(Homo sapiens (Human))
BDBM26706
(7-chloro-9-ethyl-6-methoxy-1H,3H,4H,9H-quinolino[2...)
Show SMILES CCn1c2noc(=O)c2c(O)c2cc(OC)c(Cl)cc12
Show InChI InChI=1S/C13H11ClN2O4/c1-3-16-8-5-7(14)9(19-2)4-6(8)11(17)10-12(16)15-20-13(10)18/h4-5,17H,3H2,1-2H3
>1.42E+3>-7.89n/an/an/an/an/a7.522
Abbott Laboratories
Assay Description
Assays were conducted in 384-well v-bottom polypropylene plates. Test compound was mixed with Pim and biotinylated peptide substrate, followed by imm...
Bioorg Med Chem Lett 18: 5206-8 (2008)
Article DOI: 10.1016/j.bmcl.2008.08.079
BindingDB Entry DOI: 10.7270/Q2833QBF
Serine/threonine-protein kinase pim-1
(Homo sapiens (Human))
BDBM26706
(7-chloro-9-ethyl-6-methoxy-1H,3H,4H,9H-quinolino[2...)
Show SMILES CCn1c2noc(=O)c2c(O)c2cc(OC)c(Cl)cc12
Show InChI InChI=1S/C13H11ClN2O4/c1-3-16-8-5-7(14)9(19-2)4-6(8)11(17)10-12(16)15-20-13(10)18/h4-5,17H,3H2,1-2H3
2.70E+3 -7.52n/an/an/an/an/a7.522
Abbott Laboratories
Assay Description
Assays were conducted in 384-well v-bottom polypropylene plates. Test compound was mixed with Pim and biotinylated peptide substrate, followed by imm...
Bioorg Med Chem Lett 18: 5206-8 (2008)
Article DOI: 10.1016/j.bmcl.2008.08.079
BindingDB Entry DOI: 10.7270/Q2833QBF