BDBM267518 (R)-ethyl 3-(8-amino-1-(4-(pyridin-2-ylcarbamoyl)phenyl)imidazo[1,5-a]pyrazin-3-yl)piperidine-1-carboxylate::US9718828, Example, 48
SMILES: CCNC(=O)N1CCC[C@H](C1)c1nc(-c2ccc(cc2)C(=O)Nc2ccccn2)c2c(N)nccn12
InChI Key: InChIKey=SNXGTFFTNHRROC-LJQANCHMSA-N
Data: 1 EC50
Activity Spreadsheet -- Enzyme Inhibition Constant Data from BindingDB
Found 1 hit for monomerid = 267518
Trg + Lig
Ki
nM
ΔG°
kcal/mole
IC50
nM
Kd
nM
EC50/IC50
nM
koff
s-1
kon
M-1s-1
pHTemp
°C
Tyrosine-protein kinase BTK
(Homo sapiens (Human))
BDBM267518
((R)-ethyl 3-(8-amino-1-(4-(pyridin-2-ylcarbamoyl)p...)
Show SMILES CCNC(=O)N1CCC[C@H](C1)c1nc(-c2ccc(cc2)C(=O)Nc2ccccn2)c2c(N)nccn12 |r|
Show InChI InChI=1S/C26H28N8O2/c1-2-28-26(36)33-14-5-6-19(16-33)24-32-21(22-23(27)30-13-15-34(22)24)17-8-10-18(11-9-17)25(35)31-20-7-3-4-12-29-20/h3-4,7-13,15,19H,2,5-6,14,16H2,1H3,(H2,27,30)(H,28,36)(H,29,31,35)/t19-/m1/s1
NCI pathway
Reactome pathway
US Patent
n/an/an/an/a<10n/an/a7.225
MERCK SHARP & DOHME CORP.; MERCK SHARP & DOHME B.V.
US Patent
Assay Description
Btk enzyme activity is measured using the IMAP (immobilized metal ion affinity-based fluorescence polarization) assay as outlined below. Btk enzyme (...
US Patent US9718828 (2017)
BindingDB Entry DOI: 10.7270/Q2H9977T