null
SMILES: CC1(COC1)C(=O)N1CCO[C@H](C1)c1nc(-c2ccc(cc2F)C(=O)Nc2cc(ccn2)C(F)(F)F)c2c(N)nccn12
InChI Key: InChIKey=KIDZKZMLPUWSLF-LJQANCHMSA-N
Activity Spreadsheet -- Enzyme Inhibition Constant Data from BindingDB
Found 1 hit for monomerid = 267897
Trg + Lig
Ki
nM
ΔG°
kcal/mole
IC50
nM
Kd
nM
EC50/IC50
nM
koff
s-1
kon
M-1s-1
pHTemp
°C
Tyrosine-protein kinase BTK
(Homo sapiens (Human))
BDBM267897
(4-{8-amino-3-[(2R)-4-(cyclopropylcarbonyl)morpholi...)
Show SMILES CC1(COC1)C(=O)N1CCO[C@H](C1)c1nc(-c2ccc(cc2F)C(=O)Nc2cc(ccn2)C(F)(F)F)c2c(N)nccn12 |r|
Show InChI InChI=1S/C28H25F4N7O4/c1-27(13-42-14-27)26(41)38-8-9-43-19(12-38)24-37-21(22-23(33)35-6-7-39(22)24)17-3-2-15(10-18(17)29)25(40)36-20-11-16(4-5-34-20)28(30,31)32/h2-7,10-11,19H,8-9,12-14H2,1H3,(H2,33,35)(H,34,36,40)/t19-/m1/s1
NCI pathway
Reactome pathway
US Patent
n/an/a<10n/an/an/an/an/an/a
MERCK SHARP & DOHME CORP.; MERCK SHARP & DOHME B.V.
US Patent
Assay Description
BTK enzymatic activity was determined with the LANCE (Lanthanide Chelate Excite) TR-FRET (Time-resolved fluorescence resonance energy transfer) assay...
US Patent US9718828 (2017)
BindingDB Entry DOI: 10.7270/Q2H9977T