BDBM267997 4-cyclopropyl-2-((R)-3-methylmorpholin-4-yl)-8-(1H-pyrazol-3-yl)-[1,7]-naphthyridine::US9549932, 29
SMILES: C[C@@H]1COCCN1c1cc(C2CC2)c2ccnc(-c3ccnn3C3CCCCO3)c2n1
InChI Key: InChIKey=LQTMLFWSNBJBKT-XESZBRCGSA-N
Data: 2 IC50
Activity Spreadsheet -- Enzyme Inhibition Constant Data from BindingDB
Found 2 hits for monomerid = 267997
Trg + Lig
Ki
nM
ΔG°
kcal/mole
IC50
nM
Kd
nM
EC50/IC50
nM
koff
s-1
kon
M-1s-1
pHTemp
°C
Serine/threonine-protein kinase ATR
(Homo sapiens (Human))
BDBM267997
(4-cyclopropyl-2-((R)-3-methylmorpholin-4-yl)-8-(1H...)
Show SMILES C[C@@H]1COCCN1c1cc(C2CC2)c2ccnc(-c3ccnn3C3CCCCO3)c2n1 |r|
Show InChI InChI=1S/C24H29N5O2/c1-16-15-30-13-11-28(16)21-14-19(17-5-6-17)18-7-9-25-24(23(18)27-21)20-8-10-26-29(20)22-4-2-3-12-31-22/h7-10,14,16-17,22H,2-6,11-13,15H2,1H3/t16-,22?/m1/s1
Reactome pathway
US Patent
n/an/a 9.23n/an/an/an/a7.0n/a
Bayer Pharma Aktiengesellschaft
US Patent
Assay Description
To determine of binding activity of the test compounds, full-length human ATR protein was expressed and purified together with ATRIP as described abo...
US Patent US9549932 (2017)
BindingDB Entry DOI: 10.7270/Q27S7QSC
Serine/threonine-protein kinase ATR
(Homo sapiens (Human))
BDBM267997
(4-cyclopropyl-2-((R)-3-methylmorpholin-4-yl)-8-(1H...)
Show SMILES C[C@@H]1COCCN1c1cc(C2CC2)c2ccnc(-c3ccnn3C3CCCCO3)c2n1 |r|
Show InChI InChI=1S/C24H29N5O2/c1-16-15-30-13-11-28(16)21-14-19(17-5-6-17)18-7-9-25-24(23(18)27-21)20-8-10-26-29(20)22-4-2-3-12-31-22/h7-10,14,16-17,22H,2-6,11-13,15H2,1H3/t16-,22?/m1/s1
Reactome pathway
US Patent
n/an/a 21.5n/an/an/an/a7.0n/a
Bayer Pharma Aktiengesellschaft
US Patent
Assay Description
To determine of binding activity of the test compounds, full-length human ATR protein was expressed and purified together with ATRIP as described abo...
US Patent US9549932 (2017)
BindingDB Entry DOI: 10.7270/Q27S7QSC